{"text_format":"1","workbook":"xlsx","n_sheets":3,"sheets":["Objednavka","Sheet1","Faktura"],"not_rendered":{"charts":0,"images":3,"macros":1,"external_links":0,"defined_names":3,"comments":1,"pivot_tables":0},"unopened":[],"bounds":{"document_bytes":16777216,"sheet_cells":100000,"rows_first":2000,"rows_last":500,"rows_between":2000,"halvings":0,"cell_chars":16384,"cell_head_chars":4096},"cells_cut":0,"cells_raw":0,"read":"whole","date_system":"1900"}

{"sheet":"Objednavka","index":0,"n_rows":243,"n_cols":13,"rows_kept":243,"cut":false,"hidden":false,"merged":[[0,2,0,5],[1,2,1,5],[2,2,2,5],[3,2,3,5],[4,2,4,5],[5,2,5,5],[6,2,6,5],[7,2,7,5],[8,2,10,5],[11,0,11,7],[10,6,10,8],[6,6,6,7],[7,6,7,7],[8,6,8,7],[9,6,9,7],[2,0,2,1],[3,0,3,1],[0,0,0,1],[1,0,1,1],[8,0,10,1],[7,0,7,1],[4,0,4,1],[5,0,5,1],[6,0,6,1]]}
["Zákazník",null,null,null,null,null,null,null,null,"Formulář platný od 1. 7. 2020",null,"Zrnková"," - nemletá káva"]
["Fakturační adresa",null,null,null,null,null,"Návod na vyplnění formuláře zde:",null,null,null,null,"Velmi jemně mletá"," - pro džezvu"]
["Dodací adresa",null,null,null,null,null,"https://www.neprazenakava.cz/formular",null,null,null,null,"Jemně mletá"," - na českého \"turka\""]
["Telefon",null,null,null,null,null,null,null,null,null,null,"Středně"," - jemně mletá - pro pákové kávovary"]
["E-mail",null,null,null,null,null,null,null,null,null,null,"Středně mletá"," - pro většinu automatických kávovarů a překapávačů nebo moka konvičku"]
["IČ / DIČ",null,null,null,null,null,null,null,null,null,null,"Středně"," - hrubě mletá - pro dripper, chemex, aeropress či vacuum pot"]
["Způsob platby",null,null,null,null,null,"Cena objednávky celkem bez DPH",null,{"$f":"I8*0.85","v":0},null,null,"Hrubě mletá"," - pro french press, cupping, cold brew apod."]
["Datum objednání",null,null,null,null,null,"Cena objednávky celkem s DPH",null,{"$f":"SUM(H13:H680)","v":0},"Vyplněnou objednávku nám prosím zašlete na e-mail:"]
["Poznámky",null,null,null,null,null,null,null,null,"objednavky@apecafe.cz"]
[null,null,null,null,null,null,"Cena celkem",null,{"$f":"IF(I9=\"\",I8,I8+I9)","v":0}]
[null,null,null,null,null,null,{"$f":"IF(COUNTIF(G13:G99680,\"<0\")>0,\"Počet kusů obsahuje záporná čísla\",IF(I8<200,\"Min. Hodnota VO objednávky je 200 Kč\",\"Objednávka splňuje VO podmínky a lze ji odeslat.\"))","v":"Min. Hodnota VO objednávky je 200 Kč"},null,null,"Děkujeme Vám za objednávku a přejeme krásný den! :)"]
[]
[null,null,"Název zboží","Cena za kus bez DPH","Cena za kus s DPH","Min. Počet KS","Počet kusů","Cena celkem s DPH"]
["NEPRAŽENÉ KÁVY"]
["Arabiky",null,null,null,null,null,null,null,null,{"$f":"IF(I15=\"\",\"\",VLOOKUP(I15,#REF!,2,0))","v":""}]
[null,null,"Austrálie Skybury - 1 Kg",2153,2475.9499999999998,1,0,{"$f":"IF(OR(G16=0,G16=\"\"),0,IF(G16<F16,\"Prosím, vložte min. počet kusů uvedený ve vedlejším sloupečku nebo 0\",E16*G16))","v":0}]
[null,null,"Bolívie - Altura EP Washed Bourbon Organic - 1 Kg",479,550.84999999999991,1,0,0,null,{"$f":"IF(I17=\"\",\"\",VLOOKUP(I17,L15:M25,2,0))","v":""}]
[null,null,"Bolívie - Altura EP Washed Bourbon Organic - 5 Kg",2061,2370.1499999999996,1,0,0,null,{"$f":"IF(I18=\"\",\"\",VLOOKUP(I18,L15:M27,2,0))","v":""}]
[null,null,"Bolívie - Altura EP Washed Bourbon Organic - 5 Kg",2061,2370.1499999999996,1,0,0,null,{"$f":"IF(I19=\"\",\"\",VLOOKUP(I19,L16:M28,2,0))","v":""}]
[null,null,"Bolívie - Altura EP Washed Bourbon Organic - 10 Kg",3617,4159.5499999999993,1,0,0]
[null,null,"Bolívie - Altura EP Washed Bourbon Organic - 20 Kg",6452,7419.7999999999993,1,0,0]
[null,null,"Bolívie - Altura EP Washed Bourbon Organic - 40 Kg",11617,13359.55,1,0,0]
[null,null,"Bolívie - Altura EP Washed Bourbon Organic - 60 Kg",15861,18240.149999999998,1,0,0]
[null,null,"Bolívie - Altura EP Washed Bourbon Organic - 60 Kg - min. odběr 10 pytlů",14765,16979.75,10,0,0]
[null,null,"Brazílie - Santos NY 2/3, Scr 17/18 - 1 Kg",178,204.7,1,0,{"$f":"IF(OR(G25=0,G25=\"\"),0,IF(G25<F25,\"Prosím, vložte min. počet kusů uvedený ve vedlejším sloupečku nebo 0\",E25*G25))","v":0},null,{"$f":"IF(I25=\"\",\"\",VLOOKUP(I25,#REF!,2,0))","v":""}]
[null,null,"Brazílie - Santos NY 2/3, Scr 17/18 - 5 Kg",765,879.74999999999989,1,0,{"$f":"IF(OR(G26=0,G26=\"\"),0,IF(G26<F26,\"Prosím, vložte min. počet kusů uvedený ve vedlejším sloupečku nebo 0\",E26*G26))","v":0},null,{"$f":"IF(I26=\"\",\"\",VLOOKUP(I26,#REF!,2,0))","v":""}]
[null,null,"Brazílie - Santos NY 2/3, Scr 17/18 - 10 Kg",1348,1550.1999999999998,1,0,0,null,{"$f":"IF(I27=\"\",\"\",VLOOKUP(I27,#REF!,2,0))","v":""}]
[null,null,"Brazílie - Santos NY 2/3, Scr 17/18 - 20 Kg",2400,2760,1,0,0,null,{"$f":"IF(I28=\"\",\"\",VLOOKUP(I28,#REF!,2,0))","v":""}]
[null,null,"Brazílie - Santos NY 2/3, Scr 17/18 - 40 Kg",4313,4959.95,1,0,0,null,{"$f":"IF(I29=\"\",\"\",VLOOKUP(I29,#REF!,2,0))","v":""}]
[null,null,"Brazílie - Santos NY 2/3, Scr 17/18 - 59 Kg",5797,6666.5499999999993,1,0,0,null,{"$f":"IF(I30=\"\",\"\",VLOOKUP(I30,#REF!,2,0))","v":""}]
{"$rows_left_out":214}
{"sheet":"Sheet1","index":1,"n_rows":0,"n_cols":0,"rows_kept":0,"cut":false,"hidden":true,"merged":[]}

{"sheet":"Faktura","index":2,"n_rows":1007,"n_cols":14,"rows_kept":1007,"cut":false,"hidden":false,"merged":[[353,1,353,6],[354,1,354,6],[999,1,999,6],[95,7,95,8],[96,7,96,8],[97,7,97,8],[98,7,98,8],[99,7,99,8],[100,7,100,8],[101,7,101,8],[102,7,102,8],[103,7,103,8],[104,7,104,8],[105,7,105,8],[106,7,106,8],[107,7,107,8],[108,7,108,8],[109,7,109,8],[120,7,120,8],[153,7,153,8],[992,7,992,8],[993,7,993,8],[994,7,994,8],[995,7,995,8],[996,7,996,8],[997,7,997,8],[978,7,978,8],[979,7,979,8],[980,7,980,8],[963,7,963,8],[964,7,964,8],[965,7,965,8],[69,1,69,6],[70,1,70,6],[71,1,71,6],[72,1,72,6],[73,1,73,6],[74,1,74,6],[75,1,75,6],[76,1,76,6],[77,1,77,6],[78,1,78,6],[88,7,88,8],[89,7,89,8],[90,7,90,8],[91,7,91,8],[92,7,92,8],[93,7,93,8],[94,7,94,8],[79,7,79,8],[80,7,80,8],[82,7,82,8],[83,7,83,8],[84,7,84,8],[85,7,85,8],[86,7,86,8],[87,7,87,8],[69,7,69,8],[70,7,70,8],[71,7,71,8],[73,7,73,8],[74,7,74,8],[75,7,75,8],[76,7,76,8],[42,7,42,8],[43,7,43,8],[44,7,44,8],[45,7,45,8],[46,7,46,8],[47,7,47,8],[48,7,48,8],[49,7,49,8],[50,7,50,8],[65,1,65,6],[65,7,65,8],[66,1,66,6],[66,7,66,8],[67,1,67,6],[67,7,67,8],[68,1,68,6],[68,7,68,8],[51,7,51,8],[52,7,52,8],[53,7,53,8],[54,7,54,8],[55,7,55,8],[56,7,56,8],[57,7,57,8],[58,7,58,8],[59,7,59,8],[28,1,28,6],[28,7,28,8],[29,7,29,8],[30,7,30,8],[31,7,31,8],[32,7,32,8],[33,7,33,8],[34,7,34,8],[35,7,35,8],[36,7,36,8],[37,7,37,8],[38,7,38,8],[39,7,39,8],[40,7,40,8],[41,7,41,8],[990,7,990,8],[991,7,991,8],[981,7,981,8],[982,7,982,8],[983,7,983,8],[984,7,984,8],[985,7,985,8],[986,7,986,8],[987,7,987,8],[988,7,988,8],[989,7,989,8],[972,7,972,8],[973,7,973,8],[974,7,974,8],[975,7,975,8],[976,7,976,8],[977,7,977,8],[966,7,966,8],[967,7,967,8],[968,7,968,8],[969,7,969,8],[970,7,970,8],[971,7,971,8],[948,7,948,8],[949,7,949,8],[950,7,950,8],[951,7,951,8],[952,7,952,8],[953,7,953,8],[960,7,960,8],[961,7,961,8],[962,7,962,8],[939,7,939,8],[940,7,940,8],[941,7,941,8],[942,7,942,8],[943,7,943,8],[944,7,944,8],[945,7,945,8],[946,7,946,8],[947,7,947,8],[957,7,957,8],[958,7,958,8],[959,7,959,8],[930,7,930,8],[931,7,931,8],[932,7,932,8],[933,7,933,8],[934,7,934,8],[935,7,935,8],[936,7,936,8],[937,7,937,8],[938,7,938,8],[921,7,921,8],[922,7,922,8],[923,7,923,8],[924,7,924,8],[925,7,925,8],[926,7,926,8],[927,7,927,8],[928,7,928,8],[929,7,929,8],[912,7,912,8],[913,7,913,8],[914,7,914,8],[915,7,915,8],[916,7,916,8],[917,7,917,8],[918,7,918,8],[919,7,919,8],[920,7,920,8],[903,7,903,8],[904,7,904,8],[905,7,905,8],[906,7,906,8],[907,7,907,8],[908,7,908,8],[909,7,909,8],[910,7,910,8],[911,7,911,8],[894,7,894,8],[895,7,895,8],[896,7,896,8],[897,7,897,8],[898,7,898,8],[899,7,899,8],[900,7,900,8],[901,7,901,8],[902,7,902,8],[885,7,885,8],[886,7,886,8],[887,7,887,8],[888,7,888,8],[889,7,889,8],[890,7,890,8],[891,7,891,8],[892,7,892,8],[893,7,893,8],[876,7,876,8],[877,7,877,8],[878,7,878,8],[879,7,879,8],[880,7,880,8],[881,7,881,8],[882,7,882,8],[883,7,883,8],[884,7,884,8],[867,7,867,8],[868,7,868,8],[869,7,869,8],[870,7,870,8],[871,7,871,8],[872,7,872,8],[873,7,873,8],[874,7,874,8],[875,7,875,8],[858,7,858,8],[859,7,859,8],[860,7,860,8],[861,7,861,8],[862,7,862,8],[863,7,863,8],[864,7,864,8],[865,7,865,8],[866,7,866,8],[849,7,849,8],[850,7,850,8],[851,7,851,8],[852,7,852,8],[853,7,853,8],[854,7,854,8],[855,7,855,8],[856,7,856,8],[857,7,857,8],[840,7,840,8],[841,7,841,8],[842,7,842,8],[843,7,843,8],[844,7,844,8],[845,7,845,8],[846,7,846,8],[847,7,847,8],[848,7,848,8],[831,7,831,8],[832,7,832,8],[833,7,833,8],[834,7,834,8],[835,7,835,8],[836,7,836,8],[837,7,837,8],[838,7,838,8],[839,7,839,8],[822,7,822,8],[823,7,823,8],[824,7,824,8],[825,7,825,8],[826,7,826,8],[827,7,827,8],[828,7,828,8],[829,7,829,8],[830,7,830,8],[813,7,813,8],[814,7,814,8],[815,7,815,8],[816,7,816,8],[817,7,817,8],[818,7,818,8],[819,7,819,8],[820,7,820,8],[821,7,821,8],[804,7,804,8],[805,7,805,8],[806,7,806,8],[807,7,807,8],[808,7,808,8],[809,7,809,8],[810,7,810,8],[811,7,811,8],[812,7,812,8],[795,7,795,8],[796,7,796,8],[797,7,797,8],[798,7,798,8],[799,7,799,8],[800,7,800,8],[801,7,801,8],[802,7,802,8],[803,7,803,8],[786,7,786,8],[787,7,787,8],[788,7,788,8],[789,7,789,8],[790,7,790,8],[791,7,791,8],[792,7,792,8],[793,7,793,8],[794,7,794,8],[777,7,777,8],[778,7,778,8],[779,7,779,8],[780,7,780,8],[781,7,781,8],[782,7,782,8],[783,7,783,8],[784,7,784,8],[785,7,785,8],[768,7,768,8],[769,7,769,8],[770,7,770,8],[771,7,771,8],[772,7,772,8],[773,7,773,8],[774,7,774,8],[775,7,775,8],[776,7,776,8],[759,7,759,8],[760,7,760,8],[761,7,761,8],[762,7,762,8],[763,7,763,8],[764,7,764,8],[765,7,765,8],[766,7,766,8],[767,7,767,8],[750,7,750,8],[751,7,751,8],[752,7,752,8],[753,7,753,8],[754,7,754,8],[755,7,755,8],[756,7,756,8],[757,7,757,8],[758,7,758,8],[741,7,741,8],[742,7,742,8],[743,7,743,8],[744,7,744,8],[745,7,745,8],[746,7,746,8],[747,7,747,8],[748,7,748,8],[749,7,749,8],[732,7,732,8],[733,7,733,8],[734,7,734,8],[735,7,735,8],[736,7,736,8],[737,7,737,8],[738,7,738,8],[739,7,739,8],[740,7,740,8],[723,7,723,8],[724,7,724,8],[725,7,725,8],[726,7,726,8],[727,7,727,8],[728,7,728,8],[729,7,729,8],[730,7,730,8],[731,7,731,8],[714,7,714,8],[715,7,715,8],[716,7,716,8],[717,7,717,8],[718,7,718,8],[719,7,719,8],[720,7,720,8],[721,7,721,8],[722,7,722,8],[705,7,705,8],[706,7,706,8],[707,7,707,8],[708,7,708,8],[709,7,709,8],[710,7,710,8],[711,7,711,8],[712,7,712,8],[713,7,713,8],[696,7,696,8],[697,7,697,8],[698,7,698,8],[699,7,699,8],[700,7,700,8],[701,7,701,8],[702,7,702,8],[703,7,703,8],[704,7,704,8],[687,7,687,8],[688,7,688,8],[689,7,689,8],[690,7,690,8],[691,7,691,8],[692,7,692,8],[693,7,693,8],[694,7,694,8],[695,7,695,8],[678,7,678,8],[679,7,679,8],[680,7,680,8],[681,7,681,8],[682,7,682,8],[683,7,683,8],[684,7,684,8],[685,7,685,8],[686,7,686,8],[669,7,669,8],[670,7,670,8],[671,7,671,8],[672,7,672,8],[673,7,673,8],[674,7,674,8],[675,7,675,8],[676,7,676,8],[677,7,677,8],[660,7,660,8],[661,7,661,8],[662,7,662,8],[663,7,663,8],[664,7,664,8],[665,7,665,8],[666,7,666,8],[667,7,667,8],[668,7,668,8],[651,7,651,8],[652,7,652,8],[653,7,653,8],[654,7,654,8],[655,7,655,8],[656,7,656,8],[657,7,657,8],[658,7,658,8],[659,7,659,8],[642,7,642,8],[643,7,643,8],[644,7,644,8],[645,7,645,8],[646,7,646,8],[647,7,647,8],[648,7,648,8],[649,7,649,8],[650,7,650,8],[633,7,633,8],[634,7,634,8],[635,7,635,8],[636,7,636,8],[637,7,637,8],[638,7,638,8],[639,7,639,8],[640,7,640,8],[641,7,641,8],[624,7,624,8],[625,7,625,8],[626,7,626,8],[627,7,627,8],[628,7,628,8],[629,7,629,8],[630,7,630,8],[631,7,631,8],[632,7,632,8],[615,7,615,8],[616,7,616,8],[617,7,617,8],[618,7,618,8],[619,7,619,8],[620,7,620,8],[621,7,621,8],[622,7,622,8],[623,7,623,8],[606,7,606,8],[607,7,607,8],[608,7,608,8],[609,7,609,8],[610,7,610,8],[611,7,611,8],[612,7,612,8],[613,7,613,8],[614,7,614,8],[597,7,597,8],[598,7,598,8],[599,7,599,8],[600,7,600,8],[601,7,601,8],[602,7,602,8],[603,7,603,8],[604,7,604,8],[605,7,605,8],[588,7,588,8],[589,7,589,8],[590,7,590,8],[591,7,591,8],[592,7,592,8],[593,7,593,8],[594,7,594,8],[595,7,595,8],[596,7,596,8],[579,7,579,8],[580,7,580,8],[581,7,581,8],[582,7,582,8],[583,7,583,8],[584,7,584,8],[585,7,585,8],[586,7,586,8],[587,7,587,8],[570,7,570,8],[571,7,571,8],[572,7,572,8],[573,7,573,8],[574,7,574,8],[575,7,575,8],[576,7,576,8],[577,7,577,8],[578,7,578,8],[561,7,561,8],[562,7,562,8],[563,7,563,8],[564,7,564,8],[565,7,565,8],[566,7,566,8],[567,7,567,8],[568,7,568,8],[569,7,569,8],[552,7,552,8],[553,7,553,8],[554,7,554,8],[555,7,555,8],[556,7,556,8],[557,7,557,8],[558,7,558,8],[559,7,559,8],[560,7,560,8],[543,7,543,8],[544,7,544,8],[545,7,545,8],[546,7,546,8],[547,7,547,8],[548,7,548,8],[549,7,549,8],[550,7,550,8],[551,7,551,8],[534,7,534,8],[535,7,535,8],[536,7,536,8],[537,7,537,8],[538,7,538,8],[539,7,539,8],[540,7,540,8],[541,7,541,8],[542,7,542,8],[525,7,525,8],[526,7,526,8],[527,7,527,8],[528,7,528,8],[529,7,529,8],[530,7,530,8],[531,7,531,8],[532,7,532,8],[533,7,533,8],[516,7,516,8],[517,7,517,8],[518,7,518,8],[519,7,519,8],[520,7,520,8],[521,7,521,8],[522,7,522,8],[523,7,523,8],[524,7,524,8],[507,7,507,8],[508,7,508,8],[509,7,509,8],[510,7,510,8],[511,7,511,8],[512,7,512,8],[513,7,513,8],[514,7,514,8],[515,7,515,8],[498,7,498,8],[499,7,499,8],[500,7,500,8],[501,7,501,8],[502,7,502,8],[503,7,503,8],[504,7,504,8],[505,7,505,8],[506,7,506,8],[489,7,489,8],[490,7,490,8],[491,7,491,8],[492,7,492,8],[493,7,493,8],[494,7,494,8],[495,7,495,8],[496,7,496,8],[497,7,497,8],[480,7,480,8],[481,7,481,8],[482,7,482,8],[483,7,483,8],[484,7,484,8],[485,7,485,8],[486,7,486,8],[487,7,487,8],[488,7,488,8],[471,7,471,8],[472,7,472,8],[473,7,473,8],[474,7,474,8],[475,7,475,8],[476,7,476,8],[477,7,477,8],[478,7,478,8],[479,7,479,8],[462,7,462,8],[463,7,463,8],[464,7,464,8],[465,7,465,8],[466,7,466,8],[467,7,467,8],[468,7,468,8],[469,7,469,8],[470,7,470,8],[453,7,453,8],[454,7,454,8],[455,7,455,8],[456,7,456,8],[457,7,457,8],[458,7,458,8],[459,7,459,8],[460,7,460,8],[461,7,461,8],[444,7,444,8],[445,7,445,8],[446,7,446,8],[447,7,447,8],[448,7,448,8],[449,7,449,8],[450,7,450,8],[451,7,451,8],[452,7,452,8],[435,7,435,8],[436,7,436,8],[437,7,437,8],[438,7,438,8],[439,7,439,8],[440,7,440,8],[441,7,441,8],[442,7,442,8],[443,7,443,8],[426,7,426,8],[427,7,427,8],[428,7,428,8],[429,7,429,8],[430,7,430,8],[431,7,431,8],[432,7,432,8],[433,7,433,8],[434,7,434,8],[417,7,417,8],[418,7,418,8],[419,7,419,8],[420,7,420,8],[421,7,421,8],[422,7,422,8],[423,7,423,8],[424,7,424,8],[425,7,425,8],[408,7,408,8],[409,7,409,8],[410,7,410,8],[411,7,411,8],[412,7,412,8],[413,7,413,8],[414,7,414,8],[415,7,415,8],[416,7,416,8],[399,7,399,8],[400,7,400,8],[401,7,401,8],[402,7,402,8],[403,7,403,8],[404,7,404,8],[405,7,405,8],[406,7,406,8],[407,7,407,8],[390,7,390,8],[391,7,391,8],[392,7,392,8],[393,7,393,8],[394,7,394,8],[395,7,395,8],[396,7,396,8],[397,7,397,8],[398,7,398,8],[381,7,381,8],[382,7,382,8],[383,7,383,8],[384,7,384,8],[385,7,385,8],[386,7,386,8],[387,7,387,8],[388,7,388,8],[389,7,389,8],[372,7,372,8],[373,7,373,8],[374,7,374,8],[375,7,375,8],[376,7,376,8],[377,7,377,8],[378,7,378,8],[379,7,379,8],[380,7,380,8],[363,7,363,8],[364,7,364,8],[365,7,365,8],[366,7,366,8],[367,7,367,8],[368,7,368,8],[369,7,369,8],[370,7,370,8],[371,7,371,8],[354,7,354,8],[355,7,355,8],[356,7,356,8],[357,7,357,8],[358,7,358,8],[359,7,359,8],[360,7,360,8],[361,7,361,8],[362,7,362,8],[322,7,322,8],[323,7,323,8],[347,7,347,8],[348,7,348,8],[349,7,349,8],[350,7,350,8],[351,7,351,8],[352,7,352,8],[353,7,353,8],[339,7,339,8],[340,7,340,8],[337,7,337,8],[338,7,338,8],[302,7,302,8],[303,7,303,8],[304,7,304,8],[305,7,305,8],[317,7,317,8],[318,7,318,8],[319,7,319,8],[320,7,320,8],[321,7,321,8],[292,7,292,8],[293,7,293,8],[294,7,294,8],[295,7,295,8],[296,7,296,8],[298,7,298,8],[299,7,299,8],[300,7,300,8],[301,7,301,8],[309,7,309,8],[310,7,310,8],[311,7,311,8],[312,7,312,8],[313,7,313,8],[314,7,314,8],[297,7,297,8],[316,7,316,8],[306,7,306,8],[307,7,307,8],[308,7,308,8],[315,7,315,8],[282,7,282,8],[283,7,283,8],[284,7,284,8],[285,7,285,8],[286,7,286,8],[287,7,287,8],[289,7,289,8],[290,7,290,8],[291,7,291,8],[272,7,272,8],[273,7,273,8],[274,7,274,8],[275,7,275,8],[276,7,276,8],[277,7,277,8],[278,7,278,8],[280,7,280,8],[281,7,281,8],[279,7,279,8],[288,7,288,8],[262,7,262,8],[263,7,263,8],[264,7,264,8],[265,7,265,8],[266,7,266,8],[267,7,267,8],[268,7,268,8],[269,7,269,8],[271,7,271,8],[251,7,251,8],[253,7,253,8],[254,7,254,8],[255,7,255,8],[256,7,256,8],[257,7,257,8],[258,7,258,8],[259,7,259,8],[260,7,260,8],[252,7,252,8],[261,7,261,8],[270,7,270,8],[241,7,241,8],[242,7,242,8],[244,7,244,8],[245,7,245,8],[246,7,246,8],[247,7,247,8],[248,7,248,8],[249,7,249,8],[250,7,250,8],[231,7,231,8],[232,7,232,8],[233,7,233,8],[235,7,235,8],[236,7,236,8],[237,7,237,8],[238,7,238,8],[239,7,239,8],[240,7,240,8],[234,7,234,8],[243,7,243,8],[221,7,221,8],[222,7,222,8],[223,7,223,8],[224,7,224,8],[226,7,226,8],[227,7,227,8],[228,7,228,8],[229,7,229,8],[230,7,230,8],[211,7,211,8],[212,7,212,8],[213,7,213,8],[214,7,214,8],[215,7,215,8],[217,7,217,8],[218,7,218,8],[219,7,219,8],[220,7,220,8],[216,7,216,8],[225,7,225,8],[201,7,201,8],[202,7,202,8],[203,7,203,8],[204,7,204,8],[205,7,205,8],[206,7,206,8],[208,7,208,8],[209,7,209,8],[210,7,210,8],[191,7,191,8],[192,7,192,8],[193,7,193,8],[194,7,194,8],[195,7,195,8],[196,7,196,8],[197,7,197,8],[199,7,199,8],[200,7,200,8],[198,7,198,8],[207,7,207,8],[181,7,181,8],[182,7,182,8],[183,7,183,8],[184,7,184,8],[185,7,185,8],[186,7,186,8],[187,7,187,8],[188,7,188,8],[190,7,190,8],[170,7,170,8],[172,7,172,8],[173,7,173,8],[174,7,174,8],[175,7,175,8],[176,7,176,8],[177,7,177,8],[178,7,178,8],[179,7,179,8],[171,7,171,8],[180,7,180,8],[189,7,189,8],[160,7,160,8],[161,7,161,8],[163,7,163,8],[164,7,164,8],[165,7,165,8],[166,7,166,8],[167,7,167,8],[168,7,168,8],[169,7,169,8],[150,7,150,8],[151,7,151,8],[152,7,152,8],[154,7,154,8],[155,7,155,8],[156,7,156,8],[157,7,157,8],[158,7,158,8],[159,7,159,8],[162,7,162,8],[140,7,140,8],[141,7,141,8],[142,7,142,8],[143,7,143,8],[145,7,145,8],[146,7,146,8],[147,7,147,8],[148,7,148,8],[149,7,149,8],[130,7,130,8],[131,7,131,8],[132,7,132,8],[133,7,133,8],[134,7,134,8],[136,7,136,8],[137,7,137,8],[138,7,138,8],[139,7,139,8],[135,7,135,8],[144,7,144,8],[121,7,121,8],[122,7,122,8],[123,7,123,8],[124,7,124,8],[125,7,125,8],[127,7,127,8],[128,7,128,8],[129,7,129,8],[110,7,110,8],[111,7,111,8],[112,7,112,8],[113,7,113,8],[114,7,114,8],[115,7,115,8],[116,7,116,8],[118,7,118,8],[119,7,119,8],[117,7,117,8],[126,7,126,8],[77,7,77,8],[78,7,78,8],[72,7,72,8],[81,7,81,8],[60,7,60,8],[998,1,998,6],[989,1,989,6],[990,1,990,6],[991,1,991,6],[992,1,992,6],[993,1,993,6],[994,1,994,6],[995,1,995,6],[996,1,996,6],[997,1,997,6],[980,1,980,6],[981,1,981,6],[982,1,982,6],[983,1,983,6],[984,1,984,6],[985,1,985,6],[986,1,986,6],[987,1,987,6],[988,1,988,6],[971,1,971,6],[972,1,972,6],[973,1,973,6],[974,1,974,6],[975,1,975,6],[976,1,976,6],[977,1,977,6],[978,1,978,6],[979,1,979,6],[962,1,962,6],[963,1,963,6],[964,1,964,6],[965,1,965,6],[966,1,966,6],[967,1,967,6],[968,1,968,6],[969,1,969,6],[970,1,970,6],[953,1,953,6]],"merged_total":1997,"flags":["merged_cut"]}
[null,"APe Pražírna a balírna s.r.o.",null,null,"",null,null,null,null,null,null,null,null,"VYPLNÍ ZAMĚSTNANEC"]
[null,null,null,null,null,"IČ: ",6649874,null,"tel./fax: ",485178008,null,null,null,"Číslo faktury: "]
[null,"Horská 564/7",null,null,null,"DIČ: ","CZ06649874",null,null,null,null,null,null,"Číslo objednávky: "]
[null,"460 14 Liberec XIV - Ruprechtice",null,null,null,"fax: ",null,null,null,485178008,null,null,null,"Datum vystavení: "]
[null,"Česká republika",null,null,null,"www.apecafe.cz",null,null,"email: ","info@apecafe.cz",null,null,null,"Datum Splatnosti: "]
[null,"Faktura - daňový doklad",null,null,null,null,null,null,null,null,{"$f":"IF(O2=\"\",\"Nevyplněno APE\",O2)","v":"Nevyplněno APE"},null,null,"Datum DUZP: "]
[]
[null,"Odběratel: ",null,null,null,null,null,null,{"$f":"IF(Objednavka!C1=\"\",\"Nevyplňeno zákazníkem\",Objednavka!C1)","v":"Nevyplňeno zákazníkem"}]
[null,"Fakturační adresa: ",null,null,null,null,null,null,{"$f":"IF(Objednavka!C2=\"\",\"Nevyplňeno zákazníkem\",Objednavka!C2)","v":"Nevyplňeno zákazníkem"}]
[null,"Dodací adresa: ",null,null,null,null,null,null,{"$f":"IF(Objednavka!C3=\"\",\"Nevyplňeno zákazníkem\",Objednavka!C3)","v":"Nevyplňeno zákazníkem"}]
[null,"Telefon: ",null,null,null,null,null,null,{"$f":"IF(Objednavka!C4=\"\",\"Nevyplňeno zákazníkem\",Objednavka!C4)","v":"Nevyplňeno zákazníkem"}]
[null,"E-mail: ",null,null,null,null,null,null,{"$f":"IF(Objednavka!C5=\"\",\"Nevyplňeno zákazníkem\",Objednavka!C5)","v":"Nevyplňeno zákazníkem"}]
[null,"IČ / DIČ: ",null,null,null,null,null,null,{"$f":"IF(Objednavka!C6=\"\",\"Nevyplňeno zákazníkem\",Objednavka!C6)","v":"Nevyplňeno zákazníkem"}]
[null,"Datum objednání: ",null,null,null,null,null,null,{"$f":"IF(Objednavka!C8=\"\",\"Nevyplňeno zákazníkem\",Objednavka!C8)","v":"Nevyplňeno zákazníkem"}]
[]
[null,"Datum",null,null,"symbol",null,null,"Způsob úhrady:",null,{"$f":"IF(Objednavka!C7=\"\",\"Nevyplňeno zákazníkem\",Objednavka!C7)","v":"Nevyplňeno zákazníkem"}]
[null,"Vystavení: ",{"$f":"IF(O4=\"\",\"Nevyplněno APE\",O4)","v":"Nevyplněno APE"},null,"konstantni:","0008",null,"Číslo objednávky:",null,{"$f":"IF(O3=\"\",\"Nevyplněno APE\",O3)","v":"Nevyplněno APE"}]
[null,"Splatnosti: ",{"$f":"IF(O5=\"\",\"Nevyplněno APE\",O5)","v":"Nevyplněno APE"},null,"variabilni:",{"$f":"IF(J17=\"VYPLNIT\",\"Nevyplňeno\",J17)","v":"Nevyplněno APE"}]
[null,"DUZP: ",{"$f":"IF(O6=\"\",\"Nevyplněno APE\",O6)","v":"Nevyplněno APE"},null,null,null,null,"Poznámky:"]
[null,null,null,null,null,null,null,{"$f":"IF(Objednavka!C9=\"\",\"Nevyplňeno zákazníkem\",Objednavka!C9)","v":"Nevyplňeno zákazníkem"}]
[null,"Bankovní účet",null,null,"Kód banky"]
[null,101426318,null,null,"0300"]
[null,"IBAN: CZ58 0300 0000 0001 0142 6318",null,null,"SWIFT: CEKOCZPP"]
[null,"Fakturujeme vám za dodané zboží:"]
[]
[]
[]
[null,"Název zboží",null,null,null,null,null,"Cena za kus bez DPH",null,"Cena za kus s DPH","Počet kusů","Cena celkem s DPH"]
[null,{"$f":"IF(INDEX(Objednavka!A:I,14,3)=\"\",INDEX(Objednavka!A:I,14,1),INDEX(Objednavka!A:I,14,3))","v":"NEPRAŽENÉ KÁVY"},null,null,null,null,null,{"$f":"INDEX(Objednavka!A:I,14,4)","v":0},null,{"$f":"INDEX(Objednavka!A:I,14,5)","v":0},{"$f":"INDEX(Objednavka!A:I,14,7)","v":0},{"$f":"INDEX(Objednavka!A:I,14,8)","v":0},null,{"$f":"IF(INDEX(Objednavka!A:J,14,10)=\"\",\"\",INDEX(Objednavka!A:J,14,10))","v":""}]
[null,{"$f":"IF(INDEX(Objednavka!A:I,15,3)=\"\",INDEX(Objednavka!A:I,15,1),INDEX(Objednavka!A:I,15,3))","v":"Arabiky"},null,null,null,null,null,{"$f":"INDEX(Objednavka!A:I,15,4)","v":0},null,{"$f":"INDEX(Objednavka!A:I,15,5)","v":0},{"$f":"INDEX(Objednavka!A:I,15,7)","v":0},{"$f":"INDEX(Objednavka!A:I,15,8)","v":0},null,{"$f":"IF(INDEX(Objednavka!A:J,15,10)=\"\",\"\",INDEX(Objednavka!A:J,15,10))","v":""}]
{"$rows_left_out":977}