{"text_format":"1","workbook":"xlsx","n_sheets":3,"sheets":["Objednavka","Sheet1","Faktura"],"not_rendered":{"charts":0,"images":3,"macros":1,"external_links":0,"defined_names":3,"comments":1,"pivot_tables":0},"unopened":[],"bounds":{"document_bytes":16777216,"sheet_cells":100000,"rows_first":2000,"rows_last":500,"rows_between":2000,"halvings":0,"cell_chars":16384,"cell_head_chars":4096},"cells_cut":0,"cells_raw":0,"read":"whole","date_system":"1900"}

{"sheet":"Objednavka","index":0,"n_rows":243,"n_cols":13,"rows_kept":243,"cut":false,"hidden":false,"merged":[[0,2,0,5],[1,2,1,5],[2,2,2,5],[3,2,3,5],[4,2,4,5],[5,2,5,5],[6,2,6,5],[7,2,7,5],[8,2,10,5],[11,0,11,7],[10,6,10,8],[6,6,6,7],[7,6,7,7],[8,6,8,7],[9,6,9,7],[2,0,2,1],[3,0,3,1],[0,0,0,1],[1,0,1,1],[8,0,10,1],[7,0,7,1],[4,0,4,1],[5,0,5,1],[6,0,6,1]]}
["Zákazník",null,null,null,null,null,null,null,null,"Formulář platný od 1. 7. 2020",null,"Zrnková"," - nemletá káva"]
["Fakturační adresa",null,null,null,null,null,"Návod na vyplnění formuláře zde:",null,null,null,null,"Velmi jemně mletá"," - pro džezvu"]
["Dodací adresa",null,null,null,null,null,"https://www.neprazenakava.cz/formular",null,null,null,null,"Jemně mletá"," - na českého \"turka\""]
["Telefon",null,null,null,null,null,null,null,null,null,null,"Středně"," - jemně mletá - pro pákové kávovary"]
["E-mail",null,null,null,null,null,null,null,null,null,null,"Středně mletá"," - pro většinu automatických kávovarů a překapávačů nebo moka konvičku"]
["IČ / DIČ",null,null,null,null,null,null,null,null,null,null,"Středně"," - hrubě mletá - pro dripper, chemex, aeropress či vacuum pot"]
["Způsob platby",null,null,null,null,null,"Cena objednávky celkem bez DPH",null,{"$f":"I8*0.85","v":0},null,null,"Hrubě mletá"," - pro french press, cupping, cold brew apod."]
["Datum objednání",null,null,null,null,null,"Cena objednávky celkem s DPH",null,{"$f":"SUM(H13:H680)","v":0},"Vyplněnou objednávku nám prosím zašlete na e-mail:"]
["Poznámky",null,null,null,null,null,null,null,null,"objednavky@apecafe.cz"]
[null,null,null,null,null,null,"Cena celkem",null,{"$f":"IF(I9=\"\",I8,I8+I9)","v":0}]
[null,null,null,null,null,null,{"$f":"IF(COUNTIF(G13:G99680,\"<0\")>0,\"Počet kusů obsahuje záporná čísla\",IF(I8<200,\"Min. Hodnota VO objednávky je 200 Kč\",\"Objednávka splňuje VO podmínky a lze ji odeslat.\"))","v":"Min. Hodnota VO objednávky je 200 Kč"},null,null,"Děkujeme Vám za objednávku a přejeme krásný den! :)"]
[]
[null,null,"Název zboží","Cena za kus bez DPH","Cena za kus s DPH","Min. Počet KS","Počet kusů","Cena celkem s DPH"]
["NEPRAŽENÉ KÁVY"]
["Arabiky",null,null,null,null,null,null,null,null,{"$f":"IF(I15=\"\",\"\",VLOOKUP(I15,#REF!,2,0))","v":""}]
[null,null,"Austrálie Skybury - 1 Kg",2153,2475.9499999999998,1,0,{"$f":"IF(OR(G16=0,G16=\"\"),0,IF(G16<F16,\"Prosím, vložte min. počet kusů uvedený ve vedlejším sloupečku nebo 0\",E16*G16))","v":0}]
[null,null,"Bolívie - Altura EP Washed Bourbon Organic - 1 Kg",479,550.84999999999991,1,0,0,null,{"$f":"IF(I17=\"\",\"\",VLOOKUP(I17,L15:M25,2,0))","v":""}]
[null,null,"Bolívie - Altura EP Washed Bourbon Organic - 5 Kg",2061,2370.1499999999996,1,0,0,null,{"$f":"IF(I18=\"\",\"\",VLOOKUP(I18,L15:M27,2,0))","v":""}]
[null,null,"Bolívie - Altura EP Washed Bourbon Organic - 5 Kg",2061,2370.1499999999996,1,0,0,null,{"$f":"IF(I19=\"\",\"\",VLOOKUP(I19,L16:M28,2,0))","v":""}]
[null,null,"Bolívie - Altura EP Washed Bourbon Organic - 10 Kg",3617,4159.5499999999993,1,0,0]
[null,null,"Bolívie - Altura EP Washed Bourbon Organic - 20 Kg",6452,7419.7999999999993,1,0,0]
[null,null,"Bolívie - Altura EP Washed Bourbon Organic - 40 Kg",11617,13359.55,1,0,0]
[null,null,"Bolívie - Altura EP Washed Bourbon Organic - 60 Kg",15861,18240.149999999998,1,0,0]
[null,null,"Bolívie - Altura EP Washed Bourbon Organic - 60 Kg - min. odběr 10 pytlů",14765,16979.75,10,0,0]
[null,null,"Brazílie - Santos NY 2/3, Scr 17/18 - 1 Kg",178,204.7,1,0,{"$f":"IF(OR(G25=0,G25=\"\"),0,IF(G25<F25,\"Prosím, vložte min. počet kusů uvedený ve vedlejším sloupečku nebo 0\",E25*G25))","v":0},null,{"$f":"IF(I25=\"\",\"\",VLOOKUP(I25,#REF!,2,0))","v":""}]
[null,null,"Brazílie - Santos NY 2/3, Scr 17/18 - 5 Kg",765,879.74999999999989,1,0,{"$f":"IF(OR(G26=0,G26=\"\"),0,IF(G26<F26,\"Prosím, vložte min. počet kusů uvedený ve vedlejším sloupečku nebo 0\",E26*G26))","v":0},null,{"$f":"IF(I26=\"\",\"\",VLOOKUP(I26,#REF!,2,0))","v":""}]
[null,null,"Brazílie - Santos NY 2/3, Scr 17/18 - 10 Kg",1348,1550.1999999999998,1,0,0,null,{"$f":"IF(I27=\"\",\"\",VLOOKUP(I27,#REF!,2,0))","v":""}]
[null,null,"Brazílie - Santos NY 2/3, Scr 17/18 - 20 Kg",2400,2760,1,0,0,null,{"$f":"IF(I28=\"\",\"\",VLOOKUP(I28,#REF!,2,0))","v":""}]
[null,null,"Brazílie - Santos NY 2/3, Scr 17/18 - 40 Kg",4313,4959.95,1,0,0,null,{"$f":"IF(I29=\"\",\"\",VLOOKUP(I29,#REF!,2,0))","v":""}]
[null,null,"Brazílie - Santos NY 2/3, Scr 17/18 - 59 Kg",5797,6666.5499999999993,1,0,0,null,{"$f":"IF(I30=\"\",\"\",VLOOKUP(I30,#REF!,2,0))","v":""}]
[null,null,"Brazílie - Santos NY 2/3, Scr 17/18 - 59 Kg - min. odběr 10 pytlů",5387,6195.0499999999993,10,0,0,null,{"$f":"IF(I31=\"\",\"\",VLOOKUP(I31,L15:M15,2,0))","v":""}]
[null,null,"Burundi - 1 Kg",410,471.49999999999994,1,0,{"$f":"IF(OR(G32=0,G32=\"\"),0,IF(G32<F32,\"Prosím, vložte min. počet kusů uvedený ve vedlejším sloupečku nebo 0\",E32*G32))","v":0}]
[null,null,"Burundi - 5 Kg",1760,2023.9999999999998,1,0,0]
[null,null,"Burundi - 10 Kg",3087,3550.0499999999997,1,0,0]
[null,null,"Burundi - 20 Kg",5513,6339.95,1,0,0]
[null,null,"Burundi - 40 Kg",9948,11440.199999999999,1,0,0]
[null,null,"Burundi - 60 Kg",13565,15599.749999999998,1,0,0]
[null,null,"Burundi - 60 Kg - min. odběr 10 pytlů",12626,14519.9,10,0,0]
[null,null,"Dominikánská republika -  Cerro Prieto Estate Washed, Miguel Tejada - 1 Kg",433,497.95,1,0,{"$f":"IF(OR(G39=0,G39=\"\"),0,IF(G39<F39,\"Prosím, vložte min. počet kusů uvedený ve vedlejším sloupečku nebo 0\",E39*G39))","v":0}]
[null,null,"Dominikánská republika -  Cerro Prieto Estate Washed, Miguel Tejada - 5 Kg",1861,2140.1499999999996,1,0,0]
[null,null,"Dominikánská republika -  Cerro Prieto Estate Washed, Miguel Tejada - 10 Kg",3270,3760.4999999999995,1,0,0]
[null,null,"Dominikánská republika -  Cerro Prieto Estate Washed, Miguel Tejada - 20 Kg",5826,6699.9,1,0,0]
[null,null,"Dominikánská republika -  Cerro Prieto Estate Washed, Miguel Tejada - 40 Kg",10504,12079.599999999999,1,0,0]
[null,null,"Dominikánská republika -  Cerro Prieto Estate Washed, Miguel Tejada - 75 Kg",17935,20625.25,1,0,0]
[null,null,"Dominikánská republika -  Cerro Prieto Estate Washed, Miguel Tejada - 75 Kg - min. odběr 10 pytlů",16696,19200.399999999998,10,0,0]
[null,null,"Etiopie Sidamo Mamo Kacha - Washed Gr. 2 - 1 Kg",365,419.74999999999994,1,0,0]
[null,null,"Etiopie Sidamo Mamo Kacha - Washed Gr. 2 - 5 Kg",1570,1805.4999999999998,1,0,0]
[null,null,"Etiopie Sidamo Mamo Kacha - Washed Gr. 2 - 10 Kg",2757,3170.5499999999997,1,0,0]
[null,null,"Etiopie Sidamo Mamo Kacha - Washed Gr. 2 - 20 Kg",4922,5660.2999999999993,1,0,0]
[null,null,"Etiopie Sidamo Mamo Kacha - Washed Gr. 2 - 40 Kg",8870,10200.5,1,0,0]
[null,null,"Etiopie Sidamo Mamo Kacha - Washed Gr. 2 - 60 Kg",12104,13919.599999999999,1,0,0]
[null,null,"Etiopie Sidamo Mamo Kacha - Washed Gr. 2 - 60 Kg - min. odběr 10 pytlů",11270,12960.499999999998,10,0,0]
[null,null,"Etiopie Yirgacheffe - 1 Kg",435,500.24999999999994,1,0,0]
[null,null,"Etiopie Yirgacheffe - 5 Kg",1870,2150.5,1,0,0]
[null,null,"Etiopie Yirgacheffe - 10 Kg",3287,3780.0499999999997,1,0,0]
[null,null,"Etiopie Yirgacheffe - 20 Kg",5843,6719.45,1,0,0,null,{"$f":"IF(I56=\"\",\"\",VLOOKUP(I56,#REF!,2,0))","v":""}]
[null,null,"Etiopie Yirgacheffe - 40 Kg",10539,12119.849999999999,1,0,0,null,{"$f":"IF(I57=\"\",\"\",VLOOKUP(I57,#REF!,2,0))","v":""}]
[null,null,"Etiopie Yirgacheffe - 60 Kg",14400,16560,1,0,0,null,{"$f":"IF(I58=\"\",\"\",VLOOKUP(I58,#REF!,2,0))","v":""}]
[null,null,"Etiopie Yirgacheffe - 60 Kg - min. odběr 10 pytlů",13409,15420.349999999999,10,0,0,null,{"$f":"IF(I59=\"\",\"\",VLOOKUP(I59,#REF!,2,0))","v":""}]
[null,null,"Guatemala SHB EP Santa Rosa - 1 Kg",274,315.09999999999997,1,0,0,null,{"$f":"IF(I60=\"\",\"\",VLOOKUP(I60,#REF!,2,0))","v":""}]
[null,null,"Guatemala SHB EP Santa Rosa - 5 Kg",1178,1354.6999999999998,1,0,0,null,{"$f":"IF(I61=\"\",\"\",VLOOKUP(I61,L54:M54,2,0))","v":""}]
[null,null,"Guatemala SHB EP Santa Rosa - 10 Kg",2070,2380.5,1,0,0,null,{"$f":"IF(I62=\"\",\"\",VLOOKUP(I62,L54:M55,2,0))","v":""}]
[null,null,"Guatemala SHB EP Santa Rosa - 20 Kg",3687,4240.0499999999993,1,0,0,null,{"$f":"IF(I63=\"\",\"\",VLOOKUP(I63,L54:M56,2,0))","v":""}]
[null,null,"Guatemala SHB EP Santa Rosa - 40 Kg",6643,7639.45,1,0,0,null,{"$f":"IF(I64=\"\",\"\",VLOOKUP(I64,L54:M58,2,0))","v":""}]
[null,null,"Guatemala SHB EP Santa Rosa - 69 Kg",10440,12005.999999999998,1,0,0]
[null,null,"Guatemala SHB EP Santa Rosa - 69 Kg - min. odběr 10 pytlů",9720,11178,10,0,0]
[null,null,"Hawaii Kona - 1 Kg",2184,2511.6,1,0,0]
[null,null,"Hawaii Kona - 5 Kg",9396,10805.4,1,0,0]
[null,null,"Hawaii Kona - 10 Kg",16487,18960.05,1,0,0]
[null,null,"Hawaii Kona - 20 Kg",29374,33780.1,1,0,0]
[null,null,"Hawaii Kona - 40 Kg",52974,60920.1,1,0,{"$f":"IF(OR(G71=0,G71=\"\"),0,IF(G71<F71,\"Prosím, vložte min. počet kusů uvedený ve vedlejším sloupečku nebo 0\",E71*G71))","v":0}]
[null,null,"Hawaii Kona - 60 Kg",72313,83159.95,1,0,0]
[null,null,"Hawaii Kona - 60 Kg - min. odběr 10 pytlů",67304,77399.599999999991,10,0,0]
[null,null,"Honduras SHG EP - 1 Kg",224,257.59999999999997,1,0,0]
[null,null,"Honduras SHG EP - 5 Kg",965,1109.75,1,0,0]
[null,null,"Honduras SHG EP - 10 Kg",1696,1950.3999999999999,1,0,0]
[null,null,"Honduras SHG EP - 20 Kg",3026,3479.8999999999996,1,0,0]
[null,null,"Honduras SHG EP - 40 Kg",5461,6280.15,1,0,0]
[null,null,"Honduras SHG EP - 69 Kg",8580,9867,1,0,0]
[null,null,"Honduras SHG EP - 69 Kg - min. odběr 10 pytlů",7980,9177,10,0,0]
[null,null,"Indie Plantation A - 1 Kg",271,311.64999999999998,1,0,0]
[null,null,"Indie Plantation A - 5 Kg",1170,1345.5,1,0,0]
[null,null,"Indie Plantation A - 10 Kg",2052,2359.7999999999997,1,0,0]
[null,null,"Indie Plantation A - 20 Kg",3652,4199.7999999999993,1,0,0]
[null,null,"Indie Plantation A - 40 Kg",6609,7600.3499999999995,1,0,0]
[null,null,"Indie Plantation A - 60 Kg",9026,10379.9,1,0,0]
[null,null,"Indie Plantation A - 60 Kg - min. odběr 10 pytlů",8400,9660,10,0,0]
[null,null,"Indie Monsooned Malabar - 1 Kg",288,331.2,1,0,0]
[null,null,"Indie Monsooned Malabar - 5 Kg",1235,1420.25,1,0,0]
[null,null,"Indie Monsooned Malabar - 10 Kg",2174,2500.1,1,0,0]
[null,null,"Indie Monsooned Malabar - 20 Kg",3861,4440.1499999999996,1,0,0]
[null,null,"Indie Monsooned Malabar - 40 Kg",6991,8039.65,1,0,0]
[null,null,"Indie Monsooned Malabar - 50 Kg",7957,9150.5499999999993,1,0,0]
[null,null,"Indie Monsooned Malabar - 50 Kg - min. odběr 10 pytlů",7392,8500.7999999999993,10,0,0]
[null,null,"Indonésie Sulawesi Kalossi - Benteng Alla Grade 1 - 1 Kg",380,436.99999999999994,1,0,{"$f":"IF(OR(G95=0,G95=\"\"),0,IF(G95<F95,\"Prosím, vložte min. počet kusů uvedený ve vedlejším sloupečku nebo 0\",E95*G95))","v":0}]
[null,null,"Indonésie Sulawesi Kalossi - Benteng Alla Grade 1 - 5 Kg",1635,1880.2499999999998,1,0,0]
[null,null,"Indonésie Sulawesi Kalossi - Benteng Alla Grade 1 - 10 Kg",2870,3300.4999999999995,1,0,0]
[null,null,"Indonésie Sulawesi Kalossi - Benteng Alla Grade 1 - 20 Kg",5113,5879.95,1,0,0]
[null,null,"Indonésie Sulawesi Kalossi - Benteng Alla Grade 1 - 40 Kg",9217,10599.55,1,0,0]
[null,null,"Indonésie Sulawesi Kalossi - Benteng Alla Grade 1 - 60 Kg",12574,14460.099999999999,1,0,0]
[null,null,"Indonésie Sulawesi Kalossi - Benteng Alla Grade 1 - 60 Kg - min. odběr 10 pytlů",11739,13499.849999999999,10,0,0]
[null,null,"Keňa AA Plus - 1 Kg",416,478.4,1,0,0]
[null,null,"Keňa AA Plus - 5 Kg",1787,2055.0499999999997,1,0,{"$f":"IF(OR(G103=0,G103=\"\"),0,IF(G103<F103,\"Prosím, vložte min. počet kusů uvedený ve vedlejším sloupečku nebo 0\",E103*G103))","v":0}]
[null,null,"Keňa AA Plus - 10 Kg",3139,3609.85,1,0,0]
[null,null,"Keňa AA Plus - 20 Kg",5600,6439.9999999999991,1,0,0]
[null,null,"Keňa AA Plus - 40 Kg",10087,11600.05,1,0,0]
[null,null,"Keňa AA Plus - 60 Kg",13774,15840.099999999999,1,0,0]
[null,null,"Keňa AA Plus - 60 Kg - min. odběr 10 pytlů",12834,14759.099999999999,10,0,0]
[null,null,"Kolumbie Excelso Maragogype – Finca el Boton - 1 Kg",730,839.49999999999989,1,0,0]
[null,null,"Kolumbie Excelso Maragogype – Finca el Boton - 5 Kg",3140,3610.9999999999995,1,0,0]
[null,null,"Kolumbie Excelso Maragogype – Finca el Boton - 10 Kg",5510,6336.4999999999991,1,0,0]
[null,null,"Kolumbie Excelso Maragogype – Finca el Boton - 20 Kg",9820,11293,1,0,0]
[null,null,"Kolumbie Excelso Maragogype – Finca el Boton - 40 Kg",17720,20378,1,0,0]
[null,null,"Kolumbie Excelso Maragogype – Finca el Boton - 60 Kg",24180,27806.999999999996,1,0,0]
[null,null,"Kolumbie Excelso Maragogype – Finca el Boton - 60 Kg - min. odběr 10 pytlů",22500,25874.999999999996,1,0,0]
[null,null,"Kolumbie Supremo - Medellin 17/18 - 1 Kg",250,287.5,1,0,0]
[null,null,"Kolumbie Supremo - Medellin 17/18 - 5 Kg",1074,1235.0999999999999,1,0,0]
[null,null,"Kolumbie Supremo - Medellin 17/18 - 10 Kg",1887,2170.0499999999997,1,0,0]
[null,null,"Kolumbie Supremo - Medellin 17/18 - 20 Kg",3357,3860.5499999999997,1,0,0]
[null,null,"Kolumbie Supremo - Medellin 17/18 - 40 Kg",6052,6959.7999999999993,1,0,0]
[null,null,"Kolumbie Supremo - Medellin 17/18 - 70 Kg",9678,11129.699999999999,1,0,0]
[null,null,"Kolumbie Supremo - Medellin 17/18 - 70 Kg - min. odběr 10 pytlů",9009,10360.349999999999,10,0,0]
[null,null,"Kostarika - Tarrazu SHB EP Tucan - 1 Kg",344,395.59999999999997,1,0,0]
[null,null,"Kostarika - Tarrazu SHB EP Tucan - 5 Kg",1483,1705.4499999999998,1,0,0]
[null,null,"Kostarika - Tarrazu SHB EP Tucan - 10 Kg",2600,2990,1,0,0]
[null,null,"Kostarika - Tarrazu SHB EP Tucan - 20 Kg",4643,5339.45,1,0,0]
[null,null,"Kostarika - Tarrazu SHB EP Tucan - 40 Kg",8348,9600.1999999999989,1,0,0]
[null,null,"Kostarika - Tarrazu SHB EP Tucan - 69 Kg",14400,16560,1,0,0]
[null,null,"Kostarika - Tarrazu SHB EP Tucan - 69 Kg - min. odběr 10 pytlů",12240,14075.999999999998,10,0,0]
[null,null,"Kostarika - Palmichal El Cedral Black Honey - 1 Kg",555,638.25,1,0,0]
[null,null,"Kostarika - Palmichal El Cedral Black Honey - 5 Kg",2390,2748.5,1,0,0]
[null,null,"Kostarika - Palmichal El Cedral Black Honey - 10 Kg",4190,4818.5,1,0,0]
[null,null,"Kostarika - Palmichal El Cedral Black Honey - 20 Kg",7460,8579,1,0,0]
[null,null,"Kostarika - Palmichal El Cedral Black Honey - 40 Kg",13480,15501.999999999998,1,0,0]
[null,null,"Kostarika - Palmichal El Cedral Black Honey - 60 Kg",18420,21183,1,0,{"$f":"IF(OR(G135=0,G135=\"\"),0,IF(G135<F135,\"Prosím, vložte min. počet kusů uvedený ve vedlejším sloupečku nebo 0\",E135*G135))","v":0}]
[null,null,"Kostarika - Palmichal El Cedral Black Honey - 60 Kg - min. odběr 10 pytlů",17100,19665,1,0,0]
[null,null,"Kuba - Serrano Lavado - 1 Kg",369,424.34999999999997,1,0,0]
[null,null,"Kuba - Serrano Lavado - 5 Kg",1587,1825.05,1,0,0]
[null,null,"Kuba - Serrano Lavado - 10 Kg",2783,3200.45,1,0,0]
[null,null,"Kuba - Serrano Lavado - 20 Kg",4957,5700.5499999999993,1,0,0]
[null,null,"Kuba - Serrano Lavado - 40 Kg",8939,10279.849999999999,1,0,0]
[null,null,"Kuba - Serrano Lavado - 60 Kg",12209,14040.349999999999,1,0,0]
[null,null,"Kuba - Serrano Lavado - 60 Kg - min. odběr 10 pytlů",11374,13080.099999999999,10,0,0]
[null,null,"Malawi - Rain Forest Alliance - 1 Kg",328,377.2,1,0,0]
[null,null,"Malawi - Rain Forest Alliance - 5 Kg",1413,1624.9499999999998,1,0,0]
[null,null,"Malawi - Rain Forest Alliance - 10 Kg",2478,2849.7,1,0,0]
[null,null,"Malawi - Rain Forest Alliance - 20 Kg",4416,5078.3999999999996,1,0,0]
[null,null,"Malawi - Rain Forest Alliance - 40 Kg",7965,9159.75,1,0,0]
[null,null,"Malawi - Rain Forest Alliance - 60 Kg",10852,12479.8,1,0,0]
[null,null,"Malawi - Rain Forest Alliance - 60 Kg - min. odběr 10 pytlů",10122,11640.3,10,0,0]
[null,null,"Mexico - SHG EP El Conejo - 1 Kg",322,370.29999999999995,1,0,0]
[null,null,"Mexico - SHG EP El Conejo - 5 Kg",1383,1590.4499999999998,1,0,0]
[null,null,"Mexico - SHG EP El Conejo - 10 Kg",2426,2789.8999999999996,1,0,0]
[null,null,"Mexico - SHG EP El Conejo - 20 Kg",4330,4979.5,1,0,0]
[null,null,"Mexico - SHG EP El Conejo - 40 Kg",7791,8959.65,1,0,0]
[null,null,"Mexico - SHG EP El Conejo - 69 Kg",12240,14075.999999999998,1,0,0]
[null,null,"Mexico - SHG EP El Conejo - 69 Kg - min. odběr 10 pytlů",11400,13109.999999999998,10,0,0]
[null,null,"Mexico bez kofeinu - El Tucan Mountain Water Process - 1 Kg",353,405.95,1,0,0]
[null,null,"Mexico bez kofeinu - El Tucan Mountain Water Process - 5 Kg",1522,1750.3,1,0,0]
[null,null,"Mexico bez kofeinu - El Tucan Mountain Water Process - 10 Kg",2670,3070.4999999999995,1,0,0]
[null,null,"Mexico bez kofeinu - El Tucan Mountain Water Process - 20 Kg",4748,5460.2,1,0,0]
[null,null,"Mexico bez kofeinu - El Tucan Mountain Water Process - 40 Kg",8591,9879.65,1,0,0]
[null,null,"Mexico bez kofeinu - El Tucan Mountain Water Process - 69 Kg",13500,15524.999999999998,1,0,0]
[null,null,"Mexico bez kofeinu - El Tucan Mountain Water Process - 69 Kg - min. odběr 10 pytlů",12540,14420.999999999998,10,0,0]
[null,null,"Panama Boquete SHP EP San Sebastian Estate - 1 Kg",448,515.19999999999993,1,0,0]
[null,null,"Panama Boquete SHP EP San Sebastian Estate - 5 Kg",1926,2214.8999999999996,1,0,0]
[null,null,"Panama Boquete SHP EP San Sebastian Estate - 10 Kg",3383,3890.45,1,0,{"$f":"IF(OR(G167=0,G167=\"\"),0,IF(G167<F167,\"Prosím, vložte min. počet kusů uvedený ve vedlejším sloupečku nebo 0\",E167*G167))","v":0}]
[null,null,"Panama Boquete SHP EP San Sebastian Estate - 20 Kg",6017,6919.5499999999993,1,0,0]
[null,null,"Panama Boquete SHP EP San Sebastian Estate - 40 Kg",10852,12479.8,1,0,0]
[null,null,"Panama Boquete SHP EP San Sebastian Estate - 60 Kg",14818,17040.699999999997,1,0,0]
[null,null,"Panama Boquete SHP EP San Sebastian Estate - 60 Kg - min. odběr 10 pytlů",13826,15899.9,10,0,0,null,{"$f":"IF(I171=\"\",\"\",VLOOKUP(I171,#REF!,2,0))","v":""}]
[null,null,"Papua - Nová Guinea - Goroka Plantation A/X - 1 Kg",314,361.09999999999997,1,0,0]
[null,null,"Papua - Nová Guinea - Goroka Plantation A/X - 5 Kg",1352,1554.8,1,0,0]
[null,null,"Papua - Nová Guinea - Goroka Plantation A/X - 10 Kg",2374,2730.1,1,0,0]
[null,null,"Papua - Nová Guinea - Goroka Plantation A/X - 20 Kg",4226,4859.8999999999996,1,0,0]
[null,null,"Papua - Nová Guinea - Goroka Plantation A/X - 40 Kg",7617,8759.5499999999993,1,0,0]
[null,null,"Papua - Nová Guinea - Goroka Plantation A/X - 60 Kg",10435,12000.249999999998,1,0,0]
[null,null,"Papua - Nová Guinea - Goroka Plantation A/X - 60 Kg - min. odběr 10 pytlů",9704,11159.599999999999,10,0,0]
[null,null,"Peru -  Grade 1 - 1 Kg",226,259.89999999999998,1,0,0,null,{"$f":"IF(I179=\"\",\"\",VLOOKUP(I179,#REF!,2,0))","v":""}]
[null,null,"Peru -  Grade 1 - 5 Kg",974,1120.0999999999999,1,0,0,null,{"$f":"IF(I180=\"\",\"\",VLOOKUP(I180,#REF!,2,0))","v":""}]
[null,null,"Peru -  Grade 1 - 10 Kg",1713,1969.9499999999998,1,0,0,null,{"$f":"IF(I181=\"\",\"\",VLOOKUP(I181,#REF!,2,0))","v":""}]
[null,null,"Peru -  Grade 1 - 20 Kg",3043,3499.45,1,0,0,null,{"$f":"IF(I182=\"\",\"\",VLOOKUP(I182,#REF!,2,0))","v":""}]
[null,null,"Peru -  Grade 1 - 40 Kg",5496,6320.4,1,0,0,null,{"$f":"IF(I183=\"\",\"\",VLOOKUP(I183,L169:M169,2,0))","v":""}]
[null,null,"Peru -  Grade 1 - 69 Kg",8640,9936,1,0,0,null,{"$f":"IF(I184=\"\",\"\",VLOOKUP(I184,L169:M170,2,0))","v":""}]
[null,null,"Peru -  Grade 1 - 69 Kg - min. odběr 10 pytlů",8040,9246,10,0,0,null,{"$f":"IF(I185=\"\",\"\",VLOOKUP(I185,L169:M171,2,0))","v":""}]
[null,null,"Rwanda AA - 1 Kg",285,327.75,1,0,0,null,{"$f":"IF(I186=\"\",\"\",VLOOKUP(I186,L169:M180,2,0))","v":""}]
[null,null,"Rwanda AA - 5 Kg",1226,1409.8999999999999,1,0,0]
[null,null,"Rwanda AA - 10 Kg",2157,2480.5499999999997,1,0,0]
[null,null,"Rwanda AA - 20 Kg",3843,4419.45,1,0,0]
[null,null,"Rwanda AA - 40 Kg",6922,7960.2999999999993,1,0,0]
[null,null,"Rwanda AA - 60 Kg",9443,10859.449999999999,1,0,0]
[null,null,"Rwanda AA - 60 Kg - min. odběr 10 pytlů",8818,10140.699999999999,10,0,0]
[null,null,"Salvador SHG EP Organic - 1 Kg",337,387.54999999999995,1,0,{"$f":"IF(OR(G193=0,G193=\"\"),0,IF(G193<F193,\"Prosím, vložte min. počet kusů uvedený ve vedlejším sloupečku nebo 0\",E193*G193))","v":0}]
[null,null,"Salvador SHG EP Organic - 5 Kg",1448,1665.1999999999998,1,0,0]
[null,null,"Salvador SHG EP Organic - 10 Kg",2539,2919.85,1,0,0]
[null,null,"Salvador SHG EP Organic - 20 Kg",4522,5200.2999999999993,1,0,0]
[null,null,"Salvador SHG EP Organic - 40 Kg",8174,9400.0999999999985,1,0,0]
[null,null,"Salvador SHG EP Organic - 69 Kg",12840,14765.999999999998,1,0,0]
[null,null,"Salvador SHG EP Organic - 69 Kg - min. odběr 10 pytlů",11940,13730.999999999998,10,0,0]
[null,null,"Tanzánie - 1 Kg",376,432.4,1,0,{"$f":"IF(OR(G200=0,G200=\"\"),0,IF(G200<F200,\"Prosím, vložte min. počet kusů uvedený ve vedlejším sloupečku nebo 0\",E200*G200))","v":0}]
[null,null,"Tanzánie - 5 Kg",1617,1859.55,1,0,0]
[null,null,"Tanzánie - 10 Kg",2835,3260.2499999999995,1,0,0]
[null,null,"Tanzánie - 20 Kg",5061,5820.15,1,0,0]
[null,null,"Tanzánie - 40 Kg",9113,10479.949999999999,1,0,0]
[null,null,"Tanzánie - 60 Kg",12470,14340.499999999998,1,0,0]
[null,null,"Tanzánie - 60 Kg - min. odběr 10 pytlů",11582,13319.3,10,0,0]
[null,null,"Zambia - Peaberry Washed - 1 Kg",450,517.5,1,0,0]
[null,null,"Zambia - Peaberry Washed - 5 Kg",1939,2229.85,1,0,0]
[null,null,"Zambia - Peaberry Washed - 10 Kg",3400,3909.9999999999995,1,0,0]
[null,null,"Zambia - Peaberry Washed - 20 Kg",6052,6959.7999999999993,1,0,0]
[null,null,"Zambia - Peaberry Washed - 40 Kg",10922,12560.3,1,0,0]
[null,null,"Zambia - Peaberry Washed - 60 Kg",14922,17160.3,1,0,0]
[null,null,"Zambia - Peaberry Washed - 60 Kg - min. odběr 10 pytlů",13878,15959.699999999999,10,0,0]
[null,null,null,null,null,1,0,{"$f":"IF(OR(G214=0,G214=\"\"),0,IF(G214<F214,\"Prosím, vložte min. počet kusů uvedený ve vedlejším sloupečku nebo 0\",E214*G214))","v":0}]
["Robusty",null,null,null,null,null,null,null,null,{"$f":"IF(I215=\"\",\"\",VLOOKUP(I215,#REF!,2,0))","v":""}]
[null,null,"Robusta India Cherry AB - 1 Kg",152,174.79999999999998,1,0,{"$f":"IF(OR(G216=0,G216=\"\"),0,IF(G216<F216,\"Prosím, vložte min. počet kusů uvedený ve vedlejším sloupečku nebo 0\",E216*G216))","v":0}]
[null,null,"Robusta India Cherry AB - 5 Kg",657,755.55,1,0,0]
[null,null,"Robusta India Cherry AB - 10 Kg",1148,1320.1999999999998,1,0,0]
[null,null,"Robusta India Cherry AB - 20 Kg",2052,2359.7999999999997,1,0,0]
[null,null,"Robusta India Cherry AB - 40 Kg",3687,4240.0499999999993,1,0,0]
[null,null,"Robusta India Cherry AB - 60 Kg",5061,5820.15,1,0,0]
[null,null,"Robusta India Cherry AB - 60 Kg - min. odběr 10 pytlů",4696,5400.4,10,0,0]
[null,null,"Robusta India Monsooned AA - 1 Kg",245,281.75,1,0,0]
[null,null,"Robusta India Monsooned AA - 5 Kg",1057,1215.55,1,0,0]
[null,null,"Robusta India Monsooned AA - 10 Kg",1852,2129.7999999999997,1,0,0]
[null,null,"Robusta India Monsooned AA - 20 Kg",3304,3799.6,1,0,0]
[null,null,"Robusta India Monsooned AA - 40 Kg",5948,6840.2,1,0,0]
[null,null,"Robusta India Monsooned AA - 60 Kg",8139,9359.8499999999985,1,0,0]
[null,null,"Robusta India Monsooned AA - 60 Kg - min. odběr 10 pytlů",7565,8699.75,10,0,0]
[null,null,"Robusta India Washed - 1 Kg",212,243.79999999999998,1,0,0]
[null,null,"Robusta India Washed - 5 Kg",913,1049.9499999999998,1,0,0]
[null,null,"Robusta India Washed - 10 Kg",1600,1839.9999999999998,1,0,0]
[null,null,"Robusta India Washed - 20 Kg",2852,3279.7999999999997,1,0,0]
[null,null,"Robusta India Washed - 40 Kg",5148,5920.2,1,0,0]
[null,null,"Robusta India Washed - 60 Kg",7043,8099.45,1,0,0]
[null,null,"Robusta India Washed - 60 Kg - min. odběr 10 pytlů",6574,7560.0999999999995,10,0,0]
[null,null,"Robusta Vietnam - 1 Kg",158,181.7,1,0,0]
[null,null,"Robusta Vietnam - 5 Kg",679,780.84999999999991,1,0,0]
[null,null,"Robusta Vietnam - 10 Kg",1191,1369.6499999999999,1,0,0]
[null,null,"Robusta Vietnam - 20 Kg",2122,2440.2999999999997,1,0,0]
[null,null,"Robusta Vietnam - 40 Kg",3826,4399.8999999999996,1,0,0]
[null,null,"Robusta Vietnam - 60 Kg",5270,6060.4999999999991,1,0,0]
[null,null,"Robusta Vietnam - 60 Kg - min. odběr 10 pytlů",4904,5639.5999999999995,10,0,0]

{"sheet":"Sheet1","index":1,"n_rows":0,"n_cols":0,"rows_kept":0,"cut":false,"hidden":true,"merged":[]}

{"sheet":"Faktura","index":2,"n_rows":1007,"n_cols":14,"rows_kept":1007,"cut":false,"hidden":false,"merged":[[353,1,353,6],[354,1,354,6],[999,1,999,6],[95,7,95,8],[96,7,96,8],[97,7,97,8],[98,7,98,8],[99,7,99,8],[100,7,100,8],[101,7,101,8],[102,7,102,8],[103,7,103,8],[104,7,104,8],[105,7,105,8],[106,7,106,8],[107,7,107,8],[108,7,108,8],[109,7,109,8],[120,7,120,8],[153,7,153,8],[992,7,992,8],[993,7,993,8],[994,7,994,8],[995,7,995,8],[996,7,996,8],[997,7,997,8],[978,7,978,8],[979,7,979,8],[980,7,980,8],[963,7,963,8],[964,7,964,8],[965,7,965,8],[69,1,69,6],[70,1,70,6],[71,1,71,6],[72,1,72,6],[73,1,73,6],[74,1,74,6],[75,1,75,6],[76,1,76,6],[77,1,77,6],[78,1,78,6],[88,7,88,8],[89,7,89,8],[90,7,90,8],[91,7,91,8],[92,7,92,8],[93,7,93,8],[94,7,94,8],[79,7,79,8],[80,7,80,8],[82,7,82,8],[83,7,83,8],[84,7,84,8],[85,7,85,8],[86,7,86,8],[87,7,87,8],[69,7,69,8],[70,7,70,8],[71,7,71,8],[73,7,73,8],[74,7,74,8],[75,7,75,8],[76,7,76,8],[42,7,42,8],[43,7,43,8],[44,7,44,8],[45,7,45,8],[46,7,46,8],[47,7,47,8],[48,7,48,8],[49,7,49,8],[50,7,50,8],[65,1,65,6],[65,7,65,8],[66,1,66,6],[66,7,66,8],[67,1,67,6],[67,7,67,8],[68,1,68,6],[68,7,68,8],[51,7,51,8],[52,7,52,8],[53,7,53,8],[54,7,54,8],[55,7,55,8],[56,7,56,8],[57,7,57,8],[58,7,58,8],[59,7,59,8],[28,1,28,6],[28,7,28,8],[29,7,29,8],[30,7,30,8],[31,7,31,8],[32,7,32,8],[33,7,33,8],[34,7,34,8],[35,7,35,8],[36,7,36,8],[37,7,37,8],[38,7,38,8],[39,7,39,8],[40,7,40,8],[41,7,41,8],[990,7,990,8],[991,7,991,8],[981,7,981,8],[982,7,982,8],[983,7,983,8],[984,7,984,8],[985,7,985,8],[986,7,986,8],[987,7,987,8],[988,7,988,8],[989,7,989,8],[972,7,972,8],[973,7,973,8],[974,7,974,8],[975,7,975,8],[976,7,976,8],[977,7,977,8],[966,7,966,8],[967,7,967,8],[968,7,968,8],[969,7,969,8],[970,7,970,8],[971,7,971,8],[948,7,948,8],[949,7,949,8],[950,7,950,8],[951,7,951,8],[952,7,952,8],[953,7,953,8],[960,7,960,8],[961,7,961,8],[962,7,962,8],[939,7,939,8],[940,7,940,8],[941,7,941,8],[942,7,942,8],[943,7,943,8],[944,7,944,8],[945,7,945,8],[946,7,946,8],[947,7,947,8],[957,7,957,8],[958,7,958,8],[959,7,959,8],[930,7,930,8],[931,7,931,8],[932,7,932,8],[933,7,933,8],[934,7,934,8],[935,7,935,8],[936,7,936,8],[937,7,937,8],[938,7,938,8],[921,7,921,8],[922,7,922,8],[923,7,923,8],[924,7,924,8],[925,7,925,8],[926,7,926,8],[927,7,927,8],[928,7,928,8],[929,7,929,8],[912,7,912,8],[913,7,913,8],[914,7,914,8],[915,7,915,8],[916,7,916,8],[917,7,917,8],[918,7,918,8],[919,7,919,8],[920,7,920,8],[903,7,903,8],[904,7,904,8],[905,7,905,8],[906,7,906,8],[907,7,907,8],[908,7,908,8],[909,7,909,8],[910,7,910,8],[911,7,911,8],[894,7,894,8],[895,7,895,8],[896,7,896,8],[897,7,897,8],[898,7,898,8],[899,7,899,8],[900,7,900,8],[901,7,901,8],[902,7,902,8],[885,7,885,8],[886,7,886,8],[887,7,887,8],[888,7,888,8],[889,7,889,8],[890,7,890,8],[891,7,891,8],[892,7,892,8],[893,7,893,8],[876,7,876,8],[877,7,877,8],[878,7,878,8],[879,7,879,8],[880,7,880,8],[881,7,881,8],[882,7,882,8],[883,7,883,8],[884,7,884,8],[867,7,867,8],[868,7,868,8],[869,7,869,8],[870,7,870,8],[871,7,871,8],[872,7,872,8],[873,7,873,8],[874,7,874,8],[875,7,875,8],[858,7,858,8],[859,7,859,8],[860,7,860,8],[861,7,861,8],[862,7,862,8],[863,7,863,8],[864,7,864,8],[865,7,865,8],[866,7,866,8],[849,7,849,8],[850,7,850,8],[851,7,851,8],[852,7,852,8],[853,7,853,8],[854,7,854,8],[855,7,855,8],[856,7,856,8],[857,7,857,8],[840,7,840,8],[841,7,841,8],[842,7,842,8],[843,7,843,8],[844,7,844,8],[845,7,845,8],[846,7,846,8],[847,7,847,8],[848,7,848,8],[831,7,831,8],[832,7,832,8],[833,7,833,8],[834,7,834,8],[835,7,835,8],[836,7,836,8],[837,7,837,8],[838,7,838,8],[839,7,839,8],[822,7,822,8],[823,7,823,8],[824,7,824,8],[825,7,825,8],[826,7,826,8],[827,7,827,8],[828,7,828,8],[829,7,829,8],[830,7,830,8],[813,7,813,8],[814,7,814,8],[815,7,815,8],[816,7,816,8],[817,7,817,8],[818,7,818,8],[819,7,819,8],[820,7,820,8],[821,7,821,8],[804,7,804,8],[805,7,805,8],[806,7,806,8],[807,7,807,8],[808,7,808,8],[809,7,809,8],[810,7,810,8],[811,7,811,8],[812,7,812,8],[795,7,795,8],[796,7,796,8],[797,7,797,8],[798,7,798,8],[799,7,799,8],[800,7,800,8],[801,7,801,8],[802,7,802,8],[803,7,803,8],[786,7,786,8],[787,7,787,8],[788,7,788,8],[789,7,789,8],[790,7,790,8],[791,7,791,8],[792,7,792,8],[793,7,793,8],[794,7,794,8],[777,7,777,8],[778,7,778,8],[779,7,779,8],[780,7,780,8],[781,7,781,8],[782,7,782,8],[783,7,783,8],[784,7,784,8],[785,7,785,8],[768,7,768,8],[769,7,769,8],[770,7,770,8],[771,7,771,8],[772,7,772,8],[773,7,773,8],[774,7,774,8],[775,7,775,8],[776,7,776,8],[759,7,759,8],[760,7,760,8],[761,7,761,8],[762,7,762,8],[763,7,763,8],[764,7,764,8],[765,7,765,8],[766,7,766,8],[767,7,767,8],[750,7,750,8],[751,7,751,8],[752,7,752,8],[753,7,753,8],[754,7,754,8],[755,7,755,8],[756,7,756,8],[757,7,757,8],[758,7,758,8],[741,7,741,8],[742,7,742,8],[743,7,743,8],[744,7,744,8],[745,7,745,8],[746,7,746,8],[747,7,747,8],[748,7,748,8],[749,7,749,8],[732,7,732,8],[733,7,733,8],[734,7,734,8],[735,7,735,8],[736,7,736,8],[737,7,737,8],[738,7,738,8],[739,7,739,8],[740,7,740,8],[723,7,723,8],[724,7,724,8],[725,7,725,8],[726,7,726,8],[727,7,727,8],[728,7,728,8],[729,7,729,8],[730,7,730,8],[731,7,731,8],[714,7,714,8],[715,7,715,8],[716,7,716,8],[717,7,717,8],[718,7,718,8],[719,7,719,8],[720,7,720,8],[721,7,721,8],[722,7,722,8],[705,7,705,8],[706,7,706,8],[707,7,707,8],[708,7,708,8],[709,7,709,8],[710,7,710,8],[711,7,711,8],[712,7,712,8],[713,7,713,8],[696,7,696,8],[697,7,697,8],[698,7,698,8],[699,7,699,8],[700,7,700,8],[701,7,701,8],[702,7,702,8],[703,7,703,8],[704,7,704,8],[687,7,687,8],[688,7,688,8],[689,7,689,8],[690,7,690,8],[691,7,691,8],[692,7,692,8],[693,7,693,8],[694,7,694,8],[695,7,695,8],[678,7,678,8],[679,7,679,8],[680,7,680,8],[681,7,681,8],[682,7,682,8],[683,7,683,8],[684,7,684,8],[685,7,685,8],[686,7,686,8],[669,7,669,8],[670,7,670,8],[671,7,671,8],[672,7,672,8],[673,7,673,8],[674,7,674,8],[675,7,675,8],[676,7,676,8],[677,7,677,8],[660,7,660,8],[661,7,661,8],[662,7,662,8],[663,7,663,8],[664,7,664,8],[665,7,665,8],[666,7,666,8],[667,7,667,8],[668,7,668,8],[651,7,651,8],[652,7,652,8],[653,7,653,8],[654,7,654,8],[655,7,655,8],[656,7,656,8],[657,7,657,8],[658,7,658,8],[659,7,659,8],[642,7,642,8],[643,7,643,8],[644,7,644,8],[645,7,645,8],[646,7,646,8],[647,7,647,8],[648,7,648,8],[649,7,649,8],[650,7,650,8],[633,7,633,8],[634,7,634,8],[635,7,635,8],[636,7,636,8],[637,7,637,8],[638,7,638,8],[639,7,639,8],[640,7,640,8],[641,7,641,8],[624,7,624,8],[625,7,625,8],[626,7,626,8],[627,7,627,8],[628,7,628,8],[629,7,629,8],[630,7,630,8],[631,7,631,8],[632,7,632,8],[615,7,615,8],[616,7,616,8],[617,7,617,8],[618,7,618,8],[619,7,619,8],[620,7,620,8],[621,7,621,8],[622,7,622,8],[623,7,623,8],[606,7,606,8],[607,7,607,8],[608,7,608,8],[609,7,609,8],[610,7,610,8],[611,7,611,8],[612,7,612,8],[613,7,613,8],[614,7,614,8],[597,7,597,8],[598,7,598,8],[599,7,599,8],[600,7,600,8],[601,7,601,8],[602,7,602,8],[603,7,603,8],[604,7,604,8],[605,7,605,8],[588,7,588,8],[589,7,589,8],[590,7,590,8],[591,7,591,8],[592,7,592,8],[593,7,593,8],[594,7,594,8],[595,7,595,8],[596,7,596,8],[579,7,579,8],[580,7,580,8],[581,7,581,8],[582,7,582,8],[583,7,583,8],[584,7,584,8],[585,7,585,8],[586,7,586,8],[587,7,587,8],[570,7,570,8],[571,7,571,8],[572,7,572,8],[573,7,573,8],[574,7,574,8],[575,7,575,8],[576,7,576,8],[577,7,577,8],[578,7,578,8],[561,7,561,8],[562,7,562,8],[563,7,563,8],[564,7,564,8],[565,7,565,8],[566,7,566,8],[567,7,567,8],[568,7,568,8],[569,7,569,8],[552,7,552,8],[553,7,553,8],[554,7,554,8],[555,7,555,8],[556,7,556,8],[557,7,557,8],[558,7,558,8],[559,7,559,8],[560,7,560,8],[543,7,543,8],[544,7,544,8],[545,7,545,8],[546,7,546,8],[547,7,547,8],[548,7,548,8],[549,7,549,8],[550,7,550,8],[551,7,551,8],[534,7,534,8],[535,7,535,8],[536,7,536,8],[537,7,537,8],[538,7,538,8],[539,7,539,8],[540,7,540,8],[541,7,541,8],[542,7,542,8],[525,7,525,8],[526,7,526,8],[527,7,527,8],[528,7,528,8],[529,7,529,8],[530,7,530,8],[531,7,531,8],[532,7,532,8],[533,7,533,8],[516,7,516,8],[517,7,517,8],[518,7,518,8],[519,7,519,8],[520,7,520,8],[521,7,521,8],[522,7,522,8],[523,7,523,8],[524,7,524,8],[507,7,507,8],[508,7,508,8],[509,7,509,8],[510,7,510,8],[511,7,511,8],[512,7,512,8],[513,7,513,8],[514,7,514,8],[515,7,515,8],[498,7,498,8],[499,7,499,8],[500,7,500,8],[501,7,501,8],[502,7,502,8],[503,7,503,8],[504,7,504,8],[505,7,505,8],[506,7,506,8],[489,7,489,8],[490,7,490,8],[491,7,491,8],[492,7,492,8],[493,7,493,8],[494,7,494,8],[495,7,495,8],[496,7,496,8],[497,7,497,8],[480,7,480,8],[481,7,481,8],[482,7,482,8],[483,7,483,8],[484,7,484,8],[485,7,485,8],[486,7,486,8],[487,7,487,8],[488,7,488,8],[471,7,471,8],[472,7,472,8],[473,7,473,8],[474,7,474,8],[475,7,475,8],[476,7,476,8],[477,7,477,8],[478,7,478,8],[479,7,479,8],[462,7,462,8],[463,7,463,8],[464,7,464,8],[465,7,465,8],[466,7,466,8],[467,7,467,8],[468,7,468,8],[469,7,469,8],[470,7,470,8],[453,7,453,8],[454,7,454,8],[455,7,455,8],[456,7,456,8],[457,7,457,8],[458,7,458,8],[459,7,459,8],[460,7,460,8],[461,7,461,8],[444,7,444,8],[445,7,445,8],[446,7,446,8],[447,7,447,8],[448,7,448,8],[449,7,449,8],[450,7,450,8],[451,7,451,8],[452,7,452,8],[435,7,435,8],[436,7,436,8],[437,7,437,8],[438,7,438,8],[439,7,439,8],[440,7,440,8],[441,7,441,8],[442,7,442,8],[443,7,443,8],[426,7,426,8],[427,7,427,8],[428,7,428,8],[429,7,429,8],[430,7,430,8],[431,7,431,8],[432,7,432,8],[433,7,433,8],[434,7,434,8],[417,7,417,8],[418,7,418,8],[419,7,419,8],[420,7,420,8],[421,7,421,8],[422,7,422,8],[423,7,423,8],[424,7,424,8],[425,7,425,8],[408,7,408,8],[409,7,409,8],[410,7,410,8],[411,7,411,8],[412,7,412,8],[413,7,413,8],[414,7,414,8],[415,7,415,8],[416,7,416,8],[399,7,399,8],[400,7,400,8],[401,7,401,8],[402,7,402,8],[403,7,403,8],[404,7,404,8],[405,7,405,8],[406,7,406,8],[407,7,407,8],[390,7,390,8],[391,7,391,8],[392,7,392,8],[393,7,393,8],[394,7,394,8],[395,7,395,8],[396,7,396,8],[397,7,397,8],[398,7,398,8],[381,7,381,8],[382,7,382,8],[383,7,383,8],[384,7,384,8],[385,7,385,8],[386,7,386,8],[387,7,387,8],[388,7,388,8],[389,7,389,8],[372,7,372,8],[373,7,373,8],[374,7,374,8],[375,7,375,8],[376,7,376,8],[377,7,377,8],[378,7,378,8],[379,7,379,8],[380,7,380,8],[363,7,363,8],[364,7,364,8],[365,7,365,8],[366,7,366,8],[367,7,367,8],[368,7,368,8],[369,7,369,8],[370,7,370,8],[371,7,371,8],[354,7,354,8],[355,7,355,8],[356,7,356,8],[357,7,357,8],[358,7,358,8],[359,7,359,8],[360,7,360,8],[361,7,361,8],[362,7,362,8],[322,7,322,8],[323,7,323,8],[347,7,347,8],[348,7,348,8],[349,7,349,8],[350,7,350,8],[351,7,351,8],[352,7,352,8],[353,7,353,8],[339,7,339,8],[340,7,340,8],[337,7,337,8],[338,7,338,8],[302,7,302,8],[303,7,303,8],[304,7,304,8],[305,7,305,8],[317,7,317,8],[318,7,318,8],[319,7,319,8],[320,7,320,8],[321,7,321,8],[292,7,292,8],[293,7,293,8],[294,7,294,8],[295,7,295,8],[296,7,296,8],[298,7,298,8],[299,7,299,8],[300,7,300,8],[301,7,301,8],[309,7,309,8],[310,7,310,8],[311,7,311,8],[312,7,312,8],[313,7,313,8],[314,7,314,8],[297,7,297,8],[316,7,316,8],[306,7,306,8],[307,7,307,8],[308,7,308,8],[315,7,315,8],[282,7,282,8],[283,7,283,8],[284,7,284,8],[285,7,285,8],[286,7,286,8],[287,7,287,8],[289,7,289,8],[290,7,290,8],[291,7,291,8],[272,7,272,8],[273,7,273,8],[274,7,274,8],[275,7,275,8],[276,7,276,8],[277,7,277,8],[278,7,278,8],[280,7,280,8],[281,7,281,8],[279,7,279,8],[288,7,288,8],[262,7,262,8],[263,7,263,8],[264,7,264,8],[265,7,265,8],[266,7,266,8],[267,7,267,8],[268,7,268,8],[269,7,269,8],[271,7,271,8],[251,7,251,8],[253,7,253,8],[254,7,254,8],[255,7,255,8],[256,7,256,8],[257,7,257,8],[258,7,258,8],[259,7,259,8],[260,7,260,8],[252,7,252,8],[261,7,261,8],[270,7,270,8],[241,7,241,8],[242,7,242,8],[244,7,244,8],[245,7,245,8],[246,7,246,8],[247,7,247,8],[248,7,248,8],[249,7,249,8],[250,7,250,8],[231,7,231,8],[232,7,232,8],[233,7,233,8],[235,7,235,8],[236,7,236,8],[237,7,237,8],[238,7,238,8],[239,7,239,8],[240,7,240,8],[234,7,234,8],[243,7,243,8],[221,7,221,8],[222,7,222,8],[223,7,223,8],[224,7,224,8],[226,7,226,8],[227,7,227,8],[228,7,228,8],[229,7,229,8],[230,7,230,8],[211,7,211,8],[212,7,212,8],[213,7,213,8],[214,7,214,8],[215,7,215,8],[217,7,217,8],[218,7,218,8],[219,7,219,8],[220,7,220,8],[216,7,216,8],[225,7,225,8],[201,7,201,8],[202,7,202,8],[203,7,203,8],[204,7,204,8],[205,7,205,8],[206,7,206,8],[208,7,208,8],[209,7,209,8],[210,7,210,8],[191,7,191,8],[192,7,192,8],[193,7,193,8],[194,7,194,8],[195,7,195,8],[196,7,196,8],[197,7,197,8],[199,7,199,8],[200,7,200,8],[198,7,198,8],[207,7,207,8],[181,7,181,8],[182,7,182,8],[183,7,183,8],[184,7,184,8],[185,7,185,8],[186,7,186,8],[187,7,187,8],[188,7,188,8],[190,7,190,8],[170,7,170,8],[172,7,172,8],[173,7,173,8],[174,7,174,8],[175,7,175,8],[176,7,176,8],[177,7,177,8],[178,7,178,8],[179,7,179,8],[171,7,171,8],[180,7,180,8],[189,7,189,8],[160,7,160,8],[161,7,161,8],[163,7,163,8],[164,7,164,8],[165,7,165,8],[166,7,166,8],[167,7,167,8],[168,7,168,8],[169,7,169,8],[150,7,150,8],[151,7,151,8],[152,7,152,8],[154,7,154,8],[155,7,155,8],[156,7,156,8],[157,7,157,8],[158,7,158,8],[159,7,159,8],[162,7,162,8],[140,7,140,8],[141,7,141,8],[142,7,142,8],[143,7,143,8],[145,7,145,8],[146,7,146,8],[147,7,147,8],[148,7,148,8],[149,7,149,8],[130,7,130,8],[131,7,131,8],[132,7,132,8],[133,7,133,8],[134,7,134,8],[136,7,136,8],[137,7,137,8],[138,7,138,8],[139,7,139,8],[135,7,135,8],[144,7,144,8],[121,7,121,8],[122,7,122,8],[123,7,123,8],[124,7,124,8],[125,7,125,8],[127,7,127,8],[128,7,128,8],[129,7,129,8],[110,7,110,8],[111,7,111,8],[112,7,112,8],[113,7,113,8],[114,7,114,8],[115,7,115,8],[116,7,116,8],[118,7,118,8],[119,7,119,8],[117,7,117,8],[126,7,126,8],[77,7,77,8],[78,7,78,8],[72,7,72,8],[81,7,81,8],[60,7,60,8],[998,1,998,6],[989,1,989,6],[990,1,990,6],[991,1,991,6],[992,1,992,6],[993,1,993,6],[994,1,994,6],[995,1,995,6],[996,1,996,6],[997,1,997,6],[980,1,980,6],[981,1,981,6],[982,1,982,6],[983,1,983,6],[984,1,984,6],[985,1,985,6],[986,1,986,6],[987,1,987,6],[988,1,988,6],[971,1,971,6],[972,1,972,6],[973,1,973,6],[974,1,974,6],[975,1,975,6],[976,1,976,6],[977,1,977,6],[978,1,978,6],[979,1,979,6],[962,1,962,6],[963,1,963,6],[964,1,964,6],[965,1,965,6],[966,1,966,6],[967,1,967,6],[968,1,968,6],[969,1,969,6],[970,1,970,6],[953,1,953,6]],"merged_total":1997,"flags":["merged_cut"]}
[null,"APe Pražírna a balírna s.r.o.",null,null,"",null,null,null,null,null,null,null,null,"VYPLNÍ ZAMĚSTNANEC"]
[null,null,null,null,null,"IČ: ",6649874,null,"tel./fax: ",485178008,null,null,null,"Číslo faktury: "]
[null,"Horská 564/7",null,null,null,"DIČ: ","CZ06649874",null,null,null,null,null,null,"Číslo objednávky: "]
[null,"460 14 Liberec XIV - Ruprechtice",null,null,null,"fax: ",null,null,null,485178008,null,null,null,"Datum vystavení: "]
[null,"Česká republika",null,null,null,"www.apecafe.cz",null,null,"email: ","info@apecafe.cz",null,null,null,"Datum Splatnosti: "]
[null,"Faktura - daňový doklad",null,null,null,null,null,null,null,null,{"$f":"IF(O2=\"\",\"Nevyplněno APE\",O2)","v":"Nevyplněno APE"},null,null,"Datum DUZP: "]
[]
[null,"Odběratel: ",null,null,null,null,null,null,{"$f":"IF(Objednavka!C1=\"\",\"Nevyplňeno zákazníkem\",Objednavka!C1)","v":"Nevyplňeno zákazníkem"}]
[null,"Fakturační adresa: ",null,null,null,null,null,null,{"$f":"IF(Objednavka!C2=\"\",\"Nevyplňeno zákazníkem\",Objednavka!C2)","v":"Nevyplňeno zákazníkem"}]
[null,"Dodací adresa: ",null,null,null,null,null,null,{"$f":"IF(Objednavka!C3=\"\",\"Nevyplňeno zákazníkem\",Objednavka!C3)","v":"Nevyplňeno zákazníkem"}]
[null,"Telefon: ",null,null,null,null,null,null,{"$f":"IF(Objednavka!C4=\"\",\"Nevyplňeno zákazníkem\",Objednavka!C4)","v":"Nevyplňeno zákazníkem"}]
[null,"E-mail: ",null,null,null,null,null,null,{"$f":"IF(Objednavka!C5=\"\",\"Nevyplňeno zákazníkem\",Objednavka!C5)","v":"Nevyplňeno zákazníkem"}]
[null,"IČ / DIČ: ",null,null,null,null,null,null,{"$f":"IF(Objednavka!C6=\"\",\"Nevyplňeno zákazníkem\",Objednavka!C6)","v":"Nevyplňeno zákazníkem"}]
[null,"Datum objednání: ",null,null,null,null,null,null,{"$f":"IF(Objednavka!C8=\"\",\"Nevyplňeno zákazníkem\",Objednavka!C8)","v":"Nevyplňeno zákazníkem"}]
[]
[null,"Datum",null,null,"symbol",null,null,"Způsob úhrady:",null,{"$f":"IF(Objednavka!C7=\"\",\"Nevyplňeno zákazníkem\",Objednavka!C7)","v":"Nevyplňeno zákazníkem"}]
[null,"Vystavení: ",{"$f":"IF(O4=\"\",\"Nevyplněno APE\",O4)","v":"Nevyplněno APE"},null,"konstantni:","0008",null,"Číslo objednávky:",null,{"$f":"IF(O3=\"\",\"Nevyplněno APE\",O3)","v":"Nevyplněno APE"}]
[null,"Splatnosti: ",{"$f":"IF(O5=\"\",\"Nevyplněno APE\",O5)","v":"Nevyplněno APE"},null,"variabilni:",{"$f":"IF(J17=\"VYPLNIT\",\"Nevyplňeno\",J17)","v":"Nevyplněno APE"}]
[null,"DUZP: ",{"$f":"IF(O6=\"\",\"Nevyplněno APE\",O6)","v":"Nevyplněno APE"},null,null,null,null,"Poznámky:"]
[null,null,null,null,null,null,null,{"$f":"IF(Objednavka!C9=\"\",\"Nevyplňeno zákazníkem\",Objednavka!C9)","v":"Nevyplňeno zákazníkem"}]
[null,"Bankovní účet",null,null,"Kód banky"]
[null,101426318,null,null,"0300"]
[null,"IBAN: CZ58 0300 0000 0001 0142 6318",null,null,"SWIFT: CEKOCZPP"]
[null,"Fakturujeme vám za dodané zboží:"]
[]
[]
[]
[null,"Název zboží",null,null,null,null,null,"Cena za kus bez DPH",null,"Cena za kus s DPH","Počet kusů","Cena celkem s DPH"]
[null,{"$f":"IF(INDEX(Objednavka!A:I,14,3)=\"\",INDEX(Objednavka!A:I,14,1),INDEX(Objednavka!A:I,14,3))","v":"NEPRAŽENÉ KÁVY"},null,null,null,null,null,{"$f":"INDEX(Objednavka!A:I,14,4)","v":0},null,{"$f":"INDEX(Objednavka!A:I,14,5)","v":0},{"$f":"INDEX(Objednavka!A:I,14,7)","v":0},{"$f":"INDEX(Objednavka!A:I,14,8)","v":0},null,{"$f":"IF(INDEX(Objednavka!A:J,14,10)=\"\",\"\",INDEX(Objednavka!A:J,14,10))","v":""}]
[null,{"$f":"IF(INDEX(Objednavka!A:I,15,3)=\"\",INDEX(Objednavka!A:I,15,1),INDEX(Objednavka!A:I,15,3))","v":"Arabiky"},null,null,null,null,null,{"$f":"INDEX(Objednavka!A:I,15,4)","v":0},null,{"$f":"INDEX(Objednavka!A:I,15,5)","v":0},{"$f":"INDEX(Objednavka!A:I,15,7)","v":0},{"$f":"INDEX(Objednavka!A:I,15,8)","v":0},null,{"$f":"IF(INDEX(Objednavka!A:J,15,10)=\"\",\"\",INDEX(Objednavka!A:J,15,10))","v":""}]
[null,{"$f":"IF(INDEX(Objednavka!A:I,16,3)=\"\",INDEX(Objednavka!A:I,16,1),INDEX(Objednavka!A:I,16,3))","v":"Austrálie Skybury - 1 Kg"},null,null,null,null,null,{"$f":"INDEX(Objednavka!A:I,16,4)","v":2153},null,{"$f":"INDEX(Objednavka!A:I,16,5)","v":2475.9499999999998},{"$f":"INDEX(Objednavka!A:I,16,7)","v":0},{"$f":"INDEX(Objednavka!A:I,16,8)","v":0},null,{"$f":"IF(INDEX(Objednavka!A:J,16,10)=\"\",\"\",INDEX(Objednavka!A:J,16,10))","v":""}]
[null,{"$f":"IF(INDEX(Objednavka!A:I,17,3)=\"\",INDEX(Objednavka!A:I,17,1),INDEX(Objednavka!A:I,17,3))","v":"Bolívie - Altura EP Washed Bourbon Organic - 1 Kg"},null,null,null,null,null,{"$f":"INDEX(Objednavka!A:I,17,4)","v":479},null,{"$f":"INDEX(Objednavka!A:I,17,5)","v":550.84999999999991},{"$f":"INDEX(Objednavka!A:I,17,7)","v":0},{"$f":"INDEX(Objednavka!A:I,17,8)","v":0},null,{"$f":"IF(INDEX(Objednavka!A:J,17,10)=\"\",\"\",INDEX(Objednavka!A:J,17,10))","v":""}]
[null,{"$f":"IF(INDEX(Objednavka!A:I,18,3)=\"\",INDEX(Objednavka!A:I,18,1),INDEX(Objednavka!A:I,18,3))","v":"Bolívie - Altura EP Washed Bourbon Organic - 5 Kg"},null,null,null,null,null,{"$f":"INDEX(Objednavka!A:I,18,4)","v":2061},null,{"$f":"INDEX(Objednavka!A:I,18,5)","v":2370.1499999999996},{"$f":"INDEX(Objednavka!A:I,18,7)","v":0},{"$f":"INDEX(Objednavka!A:I,18,8)","v":0},null,{"$f":"IF(INDEX(Objednavka!A:J,18,10)=\"\",\"\",INDEX(Objednavka!A:J,18,10))","v":""}]
[null,{"$f":"IF(INDEX(Objednavka!A:I,19,3)=\"\",INDEX(Objednavka!A:I,19,1),INDEX(Objednavka!A:I,19,3))","v":"Bolívie - Altura EP Washed Bourbon Organic - 5 Kg"},null,null,null,null,null,{"$f":"INDEX(Objednavka!A:I,19,4)","v":2061},null,{"$f":"INDEX(Objednavka!A:I,19,5)","v":2370.1499999999996},{"$f":"INDEX(Objednavka!A:I,19,7)","v":0},{"$f":"INDEX(Objednavka!A:I,19,8)","v":0},null,{"$f":"IF(INDEX(Objednavka!A:J,19,10)=\"\",\"\",INDEX(Objednavka!A:J,19,10))","v":""}]
[null,{"$f":"IF(INDEX(Objednavka!A:I,20,3)=\"\",INDEX(Objednavka!A:I,20,1),INDEX(Objednavka!A:I,20,3))","v":"Bolívie - Altura EP Washed Bourbon Organic - 10 Kg"},null,null,null,null,null,{"$f":"INDEX(Objednavka!A:I,20,4)","v":3617},null,{"$f":"INDEX(Objednavka!A:I,20,5)","v":4159.5499999999993},{"$f":"INDEX(Objednavka!A:I,20,7)","v":0},{"$f":"INDEX(Objednavka!A:I,20,8)","v":0},null,{"$f":"IF(INDEX(Objednavka!A:J,20,10)=\"\",\"\",INDEX(Objednavka!A:J,20,10))","v":""}]
[null,{"$f":"IF(INDEX(Objednavka!A:I,21,3)=\"\",INDEX(Objednavka!A:I,21,1),INDEX(Objednavka!A:I,21,3))","v":"Bolívie - Altura EP Washed Bourbon Organic - 20 Kg"},null,null,null,null,null,{"$f":"INDEX(Objednavka!A:I,21,4)","v":6452},null,{"$f":"INDEX(Objednavka!A:I,21,5)","v":7419.7999999999993},{"$f":"INDEX(Objednavka!A:I,21,7)","v":0},{"$f":"INDEX(Objednavka!A:I,21,8)","v":0},null,{"$f":"IF(INDEX(Objednavka!A:J,21,10)=\"\",\"\",INDEX(Objednavka!A:J,21,10))","v":""}]
[null,{"$f":"IF(INDEX(Objednavka!A:I,22,3)=\"\",INDEX(Objednavka!A:I,22,1),INDEX(Objednavka!A:I,22,3))","v":"Bolívie - Altura EP Washed Bourbon Organic - 40 Kg"},null,null,null,null,null,{"$f":"INDEX(Objednavka!A:I,22,4)","v":11617},null,{"$f":"INDEX(Objednavka!A:I,22,5)","v":13359.55},{"$f":"INDEX(Objednavka!A:I,22,7)","v":0},{"$f":"INDEX(Objednavka!A:I,22,8)","v":0},null,{"$f":"IF(INDEX(Objednavka!A:J,22,10)=\"\",\"\",INDEX(Objednavka!A:J,22,10))","v":""}]
[null,{"$f":"IF(INDEX(Objednavka!A:I,23,3)=\"\",INDEX(Objednavka!A:I,23,1),INDEX(Objednavka!A:I,23,3))","v":"Bolívie - Altura EP Washed Bourbon Organic - 60 Kg"},null,null,null,null,null,{"$f":"INDEX(Objednavka!A:I,23,4)","v":15861},null,{"$f":"INDEX(Objednavka!A:I,23,5)","v":18240.149999999998},{"$f":"INDEX(Objednavka!A:I,23,7)","v":0},{"$f":"INDEX(Objednavka!A:I,23,8)","v":0},null,{"$f":"IF(INDEX(Objednavka!A:J,23,10)=\"\",\"\",INDEX(Objednavka!A:J,23,10))","v":""}]
[null,{"$f":"IF(INDEX(Objednavka!A:I,24,3)=\"\",INDEX(Objednavka!A:I,24,1),INDEX(Objednavka!A:I,24,3))","v":"Bolívie - Altura EP Washed Bourbon Organic - 60 Kg - min. odběr 10 pytlů"},null,null,null,null,null,{"$f":"INDEX(Objednavka!A:I,24,4)","v":14765},null,{"$f":"INDEX(Objednavka!A:I,24,5)","v":16979.75},{"$f":"INDEX(Objednavka!A:I,24,7)","v":0},{"$f":"INDEX(Objednavka!A:I,24,8)","v":0},null,{"$f":"IF(INDEX(Objednavka!A:J,24,10)=\"\",\"\",INDEX(Objednavka!A:J,24,10))","v":""}]
[null,{"$f":"IF(INDEX(Objednavka!A:I,25,3)=\"\",INDEX(Objednavka!A:I,25,1),INDEX(Objednavka!A:I,25,3))","v":"Brazílie - Santos NY 2/3, Scr 17/18 - 1 Kg"},null,null,null,null,null,{"$f":"INDEX(Objednavka!A:I,25,4)","v":178},null,{"$f":"INDEX(Objednavka!A:I,25,5)","v":204.7},{"$f":"INDEX(Objednavka!A:I,25,7)","v":0},{"$f":"INDEX(Objednavka!A:I,25,8)","v":0},null,{"$f":"IF(INDEX(Objednavka!A:J,25,10)=\"\",\"\",INDEX(Objednavka!A:J,25,10))","v":""}]
[null,{"$f":"IF(INDEX(Objednavka!A:I,26,3)=\"\",INDEX(Objednavka!A:I,26,1),INDEX(Objednavka!A:I,26,3))","v":"Brazílie - Santos NY 2/3, Scr 17/18 - 5 Kg"},null,null,null,null,null,{"$f":"INDEX(Objednavka!A:I,26,4)","v":765},null,{"$f":"INDEX(Objednavka!A:I,26,5)","v":879.74999999999989},{"$f":"INDEX(Objednavka!A:I,26,7)","v":0},{"$f":"INDEX(Objednavka!A:I,26,8)","v":0},null,{"$f":"IF(INDEX(Objednavka!A:J,26,10)=\"\",\"\",INDEX(Objednavka!A:J,26,10))","v":""}]
[null,{"$f":"IF(INDEX(Objednavka!A:I,27,3)=\"\",INDEX(Objednavka!A:I,27,1),INDEX(Objednavka!A:I,27,3))","v":"Brazílie - Santos NY 2/3, Scr 17/18 - 10 Kg"},null,null,null,null,null,{"$f":"INDEX(Objednavka!A:I,27,4)","v":1348},null,{"$f":"INDEX(Objednavka!A:I,27,5)","v":1550.1999999999998},{"$f":"INDEX(Objednavka!A:I,27,7)","v":0},{"$f":"INDEX(Objednavka!A:I,27,8)","v":0},null,{"$f":"IF(INDEX(Objednavka!A:J,27,10)=\"\",\"\",INDEX(Objednavka!A:J,27,10))","v":""}]
[null,{"$f":"IF(INDEX(Objednavka!A:I,28,3)=\"\",INDEX(Objednavka!A:I,28,1),INDEX(Objednavka!A:I,28,3))","v":"Brazílie - Santos NY 2/3, Scr 17/18 - 20 Kg"},null,null,null,null,null,{"$f":"INDEX(Objednavka!A:I,28,4)","v":2400},null,{"$f":"INDEX(Objednavka!A:I,28,5)","v":2760},{"$f":"INDEX(Objednavka!A:I,28,7)","v":0},{"$f":"INDEX(Objednavka!A:I,28,8)","v":0},null,{"$f":"IF(INDEX(Objednavka!A:J,28,10)=\"\",\"\",INDEX(Objednavka!A:J,28,10))","v":""}]
[null,{"$f":"IF(INDEX(Objednavka!A:I,29,3)=\"\",INDEX(Objednavka!A:I,29,1),INDEX(Objednavka!A:I,29,3))","v":"Brazílie - Santos NY 2/3, Scr 17/18 - 40 Kg"},null,null,null,null,null,{"$f":"INDEX(Objednavka!A:I,29,4)","v":4313},null,{"$f":"INDEX(Objednavka!A:I,29,5)","v":4959.95},{"$f":"INDEX(Objednavka!A:I,29,7)","v":0},{"$f":"INDEX(Objednavka!A:I,29,8)","v":0},null,{"$f":"IF(INDEX(Objednavka!A:J,29,10)=\"\",\"\",INDEX(Objednavka!A:J,29,10))","v":""}]
[null,{"$f":"IF(INDEX(Objednavka!A:I,30,3)=\"\",INDEX(Objednavka!A:I,30,1),INDEX(Objednavka!A:I,30,3))","v":"Brazílie - Santos NY 2/3, Scr 17/18 - 59 Kg"},null,null,null,null,null,{"$f":"INDEX(Objednavka!A:I,30,4)","v":5797},null,{"$f":"INDEX(Objednavka!A:I,30,5)","v":6666.5499999999993},{"$f":"INDEX(Objednavka!A:I,30,7)","v":0},{"$f":"INDEX(Objednavka!A:I,30,8)","v":0},null,{"$f":"IF(INDEX(Objednavka!A:J,30,10)=\"\",\"\",INDEX(Objednavka!A:J,30,10))","v":""}]
[null,{"$f":"IF(INDEX(Objednavka!A:I,31,3)=\"\",INDEX(Objednavka!A:I,31,1),INDEX(Objednavka!A:I,31,3))","v":"Brazílie - Santos NY 2/3, Scr 17/18 - 59 Kg - min. odběr 10 pytlů"},null,null,null,null,null,{"$f":"INDEX(Objednavka!A:I,31,4)","v":5387},null,{"$f":"INDEX(Objednavka!A:I,31,5)","v":6195.0499999999993},{"$f":"INDEX(Objednavka!A:I,31,7)","v":0},{"$f":"INDEX(Objednavka!A:I,31,8)","v":0},null,{"$f":"IF(INDEX(Objednavka!A:J,31,10)=\"\",\"\",INDEX(Objednavka!A:J,31,10))","v":""}]
[null,{"$f":"IF(INDEX(Objednavka!A:I,32,3)=\"\",INDEX(Objednavka!A:I,32,1),INDEX(Objednavka!A:I,32,3))","v":"Burundi - 1 Kg"},null,null,null,null,null,{"$f":"INDEX(Objednavka!A:I,32,4)","v":410},null,{"$f":"INDEX(Objednavka!A:I,32,5)","v":471.49999999999994},{"$f":"INDEX(Objednavka!A:I,32,7)","v":0},{"$f":"INDEX(Objednavka!A:I,32,8)","v":0},null,{"$f":"IF(INDEX(Objednavka!A:J,32,10)=\"\",\"\",INDEX(Objednavka!A:J,32,10))","v":""}]
[null,{"$f":"IF(INDEX(Objednavka!A:I,33,3)=\"\",INDEX(Objednavka!A:I,33,1),INDEX(Objednavka!A:I,33,3))","v":"Burundi - 5 Kg"},null,null,null,null,null,{"$f":"INDEX(Objednavka!A:I,33,4)","v":1760},null,{"$f":"INDEX(Objednavka!A:I,33,5)","v":2023.9999999999998},{"$f":"INDEX(Objednavka!A:I,33,7)","v":0},{"$f":"INDEX(Objednavka!A:I,33,8)","v":0},null,{"$f":"IF(INDEX(Objednavka!A:J,33,10)=\"\",\"\",INDEX(Objednavka!A:J,33,10))","v":""}]
[null,{"$f":"IF(INDEX(Objednavka!A:I,34,3)=\"\",INDEX(Objednavka!A:I,34,1),INDEX(Objednavka!A:I,34,3))","v":"Burundi - 10 Kg"},null,null,null,null,null,{"$f":"INDEX(Objednavka!A:I,34,4)","v":3087},null,{"$f":"INDEX(Objednavka!A:I,34,5)","v":3550.0499999999997},{"$f":"INDEX(Objednavka!A:I,34,7)","v":0},{"$f":"INDEX(Objednavka!A:I,34,8)","v":0},null,{"$f":"IF(INDEX(Objednavka!A:J,34,10)=\"\",\"\",INDEX(Objednavka!A:J,34,10))","v":""}]
[null,{"$f":"IF(INDEX(Objednavka!A:I,35,3)=\"\",INDEX(Objednavka!A:I,35,1),INDEX(Objednavka!A:I,35,3))","v":"Burundi - 20 Kg"},null,null,null,null,null,{"$f":"INDEX(Objednavka!A:I,35,4)","v":5513},null,{"$f":"INDEX(Objednavka!A:I,35,5)","v":6339.95},{"$f":"INDEX(Objednavka!A:I,35,7)","v":0},{"$f":"INDEX(Objednavka!A:I,35,8)","v":0},null,{"$f":"IF(INDEX(Objednavka!A:J,35,10)=\"\",\"\",INDEX(Objednavka!A:J,35,10))","v":""}]
[null,{"$f":"IF(INDEX(Objednavka!A:I,36,3)=\"\",INDEX(Objednavka!A:I,36,1),INDEX(Objednavka!A:I,36,3))","v":"Burundi - 40 Kg"},null,null,null,null,null,{"$f":"INDEX(Objednavka!A:I,36,4)","v":9948},null,{"$f":"INDEX(Objednavka!A:I,36,5)","v":11440.199999999999},{"$f":"INDEX(Objednavka!A:I,36,7)","v":0},{"$f":"INDEX(Objednavka!A:I,36,8)","v":0},null,{"$f":"IF(INDEX(Objednavka!A:J,36,10)=\"\",\"\",INDEX(Objednavka!A:J,36,10))","v":""}]
[null,{"$f":"IF(INDEX(Objednavka!A:I,37,3)=\"\",INDEX(Objednavka!A:I,37,1),INDEX(Objednavka!A:I,37,3))","v":"Burundi - 60 Kg"},null,null,null,null,null,{"$f":"INDEX(Objednavka!A:I,37,4)","v":13565},null,{"$f":"INDEX(Objednavka!A:I,37,5)","v":15599.749999999998},{"$f":"INDEX(Objednavka!A:I,37,7)","v":0},{"$f":"INDEX(Objednavka!A:I,37,8)","v":0},null,{"$f":"IF(INDEX(Objednavka!A:J,37,10)=\"\",\"\",INDEX(Objednavka!A:J,37,10))","v":""}]
[null,{"$f":"IF(INDEX(Objednavka!A:I,38,3)=\"\",INDEX(Objednavka!A:I,38,1),INDEX(Objednavka!A:I,38,3))","v":"Burundi - 60 Kg - min. odběr 10 pytlů"},null,null,null,null,null,{"$f":"INDEX(Objednavka!A:I,38,4)","v":12626},null,{"$f":"INDEX(Objednavka!A:I,38,5)","v":14519.9},{"$f":"INDEX(Objednavka!A:I,38,7)","v":0},{"$f":"INDEX(Objednavka!A:I,38,8)","v":0},null,{"$f":"IF(INDEX(Objednavka!A:J,38,10)=\"\",\"\",INDEX(Objednavka!A:J,38,10))","v":""}]
[null,{"$f":"IF(INDEX(Objednavka!A:I,39,3)=\"\",INDEX(Objednavka!A:I,39,1),INDEX(Objednavka!A:I,39,3))","v":"Dominikánská republika -  Cerro Prieto Estate Washed, Miguel Tejada - 1 Kg"},null,null,null,null,null,{"$f":"INDEX(Objednavka!A:I,39,4)","v":433},null,{"$f":"INDEX(Objednavka!A:I,39,5)","v":497.95},{"$f":"INDEX(Objednavka!A:I,39,7)","v":0},{"$f":"INDEX(Objednavka!A:I,39,8)","v":0},null,{"$f":"IF(INDEX(Objednavka!A:J,39,10)=\"\",\"\",INDEX(Objednavka!A:J,39,10))","v":""}]
[null,{"$f":"IF(INDEX(Objednavka!A:I,40,3)=\"\",INDEX(Objednavka!A:I,40,1),INDEX(Objednavka!A:I,40,3))","v":"Dominikánská republika -  Cerro Prieto Estate Washed, Miguel Tejada - 5 Kg"},null,null,null,null,null,{"$f":"INDEX(Objednavka!A:I,40,4)","v":1861},null,{"$f":"INDEX(Objednavka!A:I,40,5)","v":2140.1499999999996},{"$f":"INDEX(Objednavka!A:I,40,7)","v":0},{"$f":"INDEX(Objednavka!A:I,40,8)","v":0},null,{"$f":"IF(INDEX(Objednavka!A:J,40,10)=\"\",\"\",INDEX(Objednavka!A:J,40,10))","v":""}]
[null,{"$f":"IF(INDEX(Objednavka!A:I,41,3)=\"\",INDEX(Objednavka!A:I,41,1),INDEX(Objednavka!A:I,41,3))","v":"Dominikánská republika -  Cerro Prieto Estate Washed, Miguel Tejada - 10 Kg"},null,null,null,null,null,{"$f":"INDEX(Objednavka!A:I,41,4)","v":3270},null,{"$f":"INDEX(Objednavka!A:I,41,5)","v":3760.4999999999995},{"$f":"INDEX(Objednavka!A:I,41,7)","v":0},{"$f":"INDEX(Objednavka!A:I,41,8)","v":0},null,{"$f":"IF(INDEX(Objednavka!A:J,41,10)=\"\",\"\",INDEX(Objednavka!A:J,41,10))","v":""}]
[null,{"$f":"IF(INDEX(Objednavka!A:I,42,3)=\"\",INDEX(Objednavka!A:I,42,1),INDEX(Objednavka!A:I,42,3))","v":"Dominikánská republika -  Cerro Prieto Estate Washed, Miguel Tejada - 20 Kg"},null,null,null,null,null,{"$f":"INDEX(Objednavka!A:I,42,4)","v":5826},null,{"$f":"INDEX(Objednavka!A:I,42,5)","v":6699.9},{"$f":"INDEX(Objednavka!A:I,42,7)","v":0},{"$f":"INDEX(Objednavka!A:I,42,8)","v":0},null,{"$f":"IF(INDEX(Objednavka!A:J,42,10)=\"\",\"\",INDEX(Objednavka!A:J,42,10))","v":""}]
[null,{"$f":"IF(INDEX(Objednavka!A:I,43,3)=\"\",INDEX(Objednavka!A:I,43,1),INDEX(Objednavka!A:I,43,3))","v":"Dominikánská republika -  Cerro Prieto Estate Washed, Miguel Tejada - 40 Kg"},null,null,null,null,null,{"$f":"INDEX(Objednavka!A:I,43,4)","v":10504},null,{"$f":"INDEX(Objednavka!A:I,43,5)","v":12079.599999999999},{"$f":"INDEX(Objednavka!A:I,43,7)","v":0},{"$f":"INDEX(Objednavka!A:I,43,8)","v":0},null,{"$f":"IF(INDEX(Objednavka!A:J,43,10)=\"\",\"\",INDEX(Objednavka!A:J,43,10))","v":""}]
[null,{"$f":"IF(INDEX(Objednavka!A:I,44,3)=\"\",INDEX(Objednavka!A:I,44,1),INDEX(Objednavka!A:I,44,3))","v":"Dominikánská republika -  Cerro Prieto Estate Washed, Miguel Tejada - 75 Kg"},null,null,null,null,null,{"$f":"INDEX(Objednavka!A:I,44,4)","v":17935},null,{"$f":"INDEX(Objednavka!A:I,44,5)","v":20625.25},{"$f":"INDEX(Objednavka!A:I,44,7)","v":0},{"$f":"INDEX(Objednavka!A:I,44,8)","v":0},null,{"$f":"IF(INDEX(Objednavka!A:J,44,10)=\"\",\"\",INDEX(Objednavka!A:J,44,10))","v":""}]
[null,{"$f":"IF(INDEX(Objednavka!A:I,45,3)=\"\",INDEX(Objednavka!A:I,45,1),INDEX(Objednavka!A:I,45,3))","v":"Dominikánská republika -  Cerro Prieto Estate Washed, Miguel Tejada - 75 Kg - min. odběr 10 pytlů"},null,null,null,null,null,{"$f":"INDEX(Objednavka!A:I,45,4)","v":16696},null,{"$f":"INDEX(Objednavka!A:I,45,5)","v":19200.399999999998},{"$f":"INDEX(Objednavka!A:I,45,7)","v":0},{"$f":"INDEX(Objednavka!A:I,45,8)","v":0},null,{"$f":"IF(INDEX(Objednavka!A:J,45,10)=\"\",\"\",INDEX(Objednavka!A:J,45,10))","v":""}]
[null,{"$f":"IF(INDEX(Objednavka!A:I,46,3)=\"\",INDEX(Objednavka!A:I,46,1),INDEX(Objednavka!A:I,46,3))","v":"Etiopie Sidamo Mamo Kacha - Washed Gr. 2 - 1 Kg"},null,null,null,null,null,{"$f":"INDEX(Objednavka!A:I,46,4)","v":365},null,{"$f":"INDEX(Objednavka!A:I,46,5)","v":419.74999999999994},{"$f":"INDEX(Objednavka!A:I,46,7)","v":0},{"$f":"INDEX(Objednavka!A:I,46,8)","v":0},null,{"$f":"IF(INDEX(Objednavka!A:J,46,10)=\"\",\"\",INDEX(Objednavka!A:J,46,10))","v":""}]
[null,{"$f":"IF(INDEX(Objednavka!A:I,47,3)=\"\",INDEX(Objednavka!A:I,47,1),INDEX(Objednavka!A:I,47,3))","v":"Etiopie Sidamo Mamo Kacha - Washed Gr. 2 - 5 Kg"},null,null,null,null,null,{"$f":"INDEX(Objednavka!A:I,47,4)","v":1570},null,{"$f":"INDEX(Objednavka!A:I,47,5)","v":1805.4999999999998},{"$f":"INDEX(Objednavka!A:I,47,7)","v":0},{"$f":"INDEX(Objednavka!A:I,47,8)","v":0},null,{"$f":"IF(INDEX(Objednavka!A:J,47,10)=\"\",\"\",INDEX(Objednavka!A:J,47,10))","v":""}]
[null,{"$f":"IF(INDEX(Objednavka!A:I,48,3)=\"\",INDEX(Objednavka!A:I,48,1),INDEX(Objednavka!A:I,48,3))","v":"Etiopie Sidamo Mamo Kacha - Washed Gr. 2 - 10 Kg"},null,null,null,null,null,{"$f":"INDEX(Objednavka!A:I,48,4)","v":2757},null,{"$f":"INDEX(Objednavka!A:I,48,5)","v":3170.5499999999997},{"$f":"INDEX(Objednavka!A:I,48,7)","v":0},{"$f":"INDEX(Objednavka!A:I,48,8)","v":0},null,{"$f":"IF(INDEX(Objednavka!A:J,48,10)=\"\",\"\",INDEX(Objednavka!A:J,48,10))","v":""}]
[null,{"$f":"IF(INDEX(Objednavka!A:I,49,3)=\"\",INDEX(Objednavka!A:I,49,1),INDEX(Objednavka!A:I,49,3))","v":"Etiopie Sidamo Mamo Kacha - Washed Gr. 2 - 20 Kg"},null,null,null,null,null,{"$f":"INDEX(Objednavka!A:I,49,4)","v":4922},null,{"$f":"INDEX(Objednavka!A:I,49,5)","v":5660.2999999999993},{"$f":"INDEX(Objednavka!A:I,49,7)","v":0},{"$f":"INDEX(Objednavka!A:I,49,8)","v":0},null,{"$f":"IF(INDEX(Objednavka!A:J,49,10)=\"\",\"\",INDEX(Objednavka!A:J,49,10))","v":""}]
[null,{"$f":"IF(INDEX(Objednavka!A:I,50,3)=\"\",INDEX(Objednavka!A:I,50,1),INDEX(Objednavka!A:I,50,3))","v":"Etiopie Sidamo Mamo Kacha - Washed Gr. 2 - 40 Kg"},null,null,null,null,null,{"$f":"INDEX(Objednavka!A:I,50,4)","v":8870},null,{"$f":"INDEX(Objednavka!A:I,50,5)","v":10200.5},{"$f":"INDEX(Objednavka!A:I,50,7)","v":0},{"$f":"INDEX(Objednavka!A:I,50,8)","v":0},null,{"$f":"IF(INDEX(Objednavka!A:J,50,10)=\"\",\"\",INDEX(Objednavka!A:J,50,10))","v":""}]
[null,{"$f":"IF(INDEX(Objednavka!A:I,51,3)=\"\",INDEX(Objednavka!A:I,51,1),INDEX(Objednavka!A:I,51,3))","v":"Etiopie Sidamo Mamo Kacha - Washed Gr. 2 - 60 Kg"},null,null,null,null,null,{"$f":"INDEX(Objednavka!A:I,51,4)","v":12104},null,{"$f":"INDEX(Objednavka!A:I,51,5)","v":13919.599999999999},{"$f":"INDEX(Objednavka!A:I,51,7)","v":0},{"$f":"INDEX(Objednavka!A:I,51,8)","v":0},null,{"$f":"IF(INDEX(Objednavka!A:J,51,10)=\"\",\"\",INDEX(Objednavka!A:J,51,10))","v":""}]
[null,{"$f":"IF(INDEX(Objednavka!A:I,52,3)=\"\",INDEX(Objednavka!A:I,52,1),INDEX(Objednavka!A:I,52,3))","v":"Etiopie Sidamo Mamo Kacha - Washed Gr. 2 - 60 Kg - min. odběr 10 pytlů"},null,null,null,null,null,{"$f":"INDEX(Objednavka!A:I,52,4)","v":11270},null,{"$f":"INDEX(Objednavka!A:I,52,5)","v":12960.499999999998},{"$f":"INDEX(Objednavka!A:I,52,7)","v":0},{"$f":"INDEX(Objednavka!A:I,52,8)","v":0},null,{"$f":"IF(INDEX(Objednavka!A:J,52,10)=\"\",\"\",INDEX(Objednavka!A:J,52,10))","v":""}]
[null,{"$f":"IF(INDEX(Objednavka!A:I,53,3)=\"\",INDEX(Objednavka!A:I,53,1),INDEX(Objednavka!A:I,53,3))","v":"Etiopie Yirgacheffe - 1 Kg"},null,null,null,null,null,{"$f":"INDEX(Objednavka!A:I,53,4)","v":435},null,{"$f":"INDEX(Objednavka!A:I,53,5)","v":500.24999999999994},{"$f":"INDEX(Objednavka!A:I,53,7)","v":0},{"$f":"INDEX(Objednavka!A:I,53,8)","v":0},null,{"$f":"IF(INDEX(Objednavka!A:J,53,10)=\"\",\"\",INDEX(Objednavka!A:J,53,10))","v":""}]
[null,{"$f":"IF(INDEX(Objednavka!A:I,54,3)=\"\",INDEX(Objednavka!A:I,54,1),INDEX(Objednavka!A:I,54,3))","v":"Etiopie Yirgacheffe - 5 Kg"},null,null,null,null,null,{"$f":"INDEX(Objednavka!A:I,54,4)","v":1870},null,{"$f":"INDEX(Objednavka!A:I,54,5)","v":2150.5},{"$f":"INDEX(Objednavka!A:I,54,7)","v":0},{"$f":"INDEX(Objednavka!A:I,54,8)","v":0},null,{"$f":"IF(INDEX(Objednavka!A:J,54,10)=\"\",\"\",INDEX(Objednavka!A:J,54,10))","v":""}]
[null,{"$f":"IF(INDEX(Objednavka!A:I,55,3)=\"\",INDEX(Objednavka!A:I,55,1),INDEX(Objednavka!A:I,55,3))","v":"Etiopie Yirgacheffe - 10 Kg"},null,null,null,null,null,{"$f":"INDEX(Objednavka!A:I,55,4)","v":3287},null,{"$f":"INDEX(Objednavka!A:I,55,5)","v":3780.0499999999997},{"$f":"INDEX(Objednavka!A:I,55,7)","v":0},{"$f":"INDEX(Objednavka!A:I,55,8)","v":0},null,{"$f":"IF(INDEX(Objednavka!A:J,55,10)=\"\",\"\",INDEX(Objednavka!A:J,55,10))","v":""}]
[null,{"$f":"IF(INDEX(Objednavka!A:I,56,3)=\"\",INDEX(Objednavka!A:I,56,1),INDEX(Objednavka!A:I,56,3))","v":"Etiopie Yirgacheffe - 20 Kg"},null,null,null,null,null,{"$f":"INDEX(Objednavka!A:I,56,4)","v":5843},null,{"$f":"INDEX(Objednavka!A:I,56,5)","v":6719.45},{"$f":"INDEX(Objednavka!A:I,56,7)","v":0},{"$f":"INDEX(Objednavka!A:I,56,8)","v":0},null,{"$f":"IF(INDEX(Objednavka!A:J,56,10)=\"\",\"\",INDEX(Objednavka!A:J,56,10))","v":""}]
[null,{"$f":"IF(INDEX(Objednavka!A:I,57,3)=\"\",INDEX(Objednavka!A:I,57,1),INDEX(Objednavka!A:I,57,3))","v":"Etiopie Yirgacheffe - 40 Kg"},null,null,null,null,null,{"$f":"INDEX(Objednavka!A:I,57,4)","v":10539},null,{"$f":"INDEX(Objednavka!A:I,57,5)","v":12119.849999999999},{"$f":"INDEX(Objednavka!A:I,57,7)","v":0},{"$f":"INDEX(Objednavka!A:I,57,8)","v":0},null,{"$f":"IF(INDEX(Objednavka!A:J,57,10)=\"\",\"\",INDEX(Objednavka!A:J,57,10))","v":""}]
[null,{"$f":"IF(INDEX(Objednavka!A:I,58,3)=\"\",INDEX(Objednavka!A:I,58,1),INDEX(Objednavka!A:I,58,3))","v":"Etiopie Yirgacheffe - 60 Kg"},null,null,null,null,null,{"$f":"INDEX(Objednavka!A:I,58,4)","v":14400},null,{"$f":"INDEX(Objednavka!A:I,58,5)","v":16560},{"$f":"INDEX(Objednavka!A:I,58,7)","v":0},{"$f":"INDEX(Objednavka!A:I,58,8)","v":0},null,{"$f":"IF(INDEX(Objednavka!A:J,58,10)=\"\",\"\",INDEX(Objednavka!A:J,58,10))","v":""}]
[null,{"$f":"IF(INDEX(Objednavka!A:I,59,3)=\"\",INDEX(Objednavka!A:I,59,1),INDEX(Objednavka!A:I,59,3))","v":"Etiopie Yirgacheffe - 60 Kg - min. odběr 10 pytlů"},null,null,null,null,null,{"$f":"INDEX(Objednavka!A:I,59,4)","v":13409},null,{"$f":"INDEX(Objednavka!A:I,59,5)","v":15420.349999999999},{"$f":"INDEX(Objednavka!A:I,59,7)","v":0},{"$f":"INDEX(Objednavka!A:I,59,8)","v":0},null,{"$f":"IF(INDEX(Objednavka!A:J,59,10)=\"\",\"\",INDEX(Objednavka!A:J,59,10))","v":""}]
[null,{"$f":"IF(INDEX(Objednavka!A:I,60,3)=\"\",INDEX(Objednavka!A:I,60,1),INDEX(Objednavka!A:I,60,3))","v":"Guatemala SHB EP Santa Rosa - 1 Kg"},null,null,null,null,null,{"$f":"INDEX(Objednavka!A:I,60,4)","v":274},null,{"$f":"INDEX(Objednavka!A:I,60,5)","v":315.09999999999997},{"$f":"INDEX(Objednavka!A:I,60,7)","v":0},{"$f":"INDEX(Objednavka!A:I,60,8)","v":0},null,{"$f":"IF(INDEX(Objednavka!A:J,60,10)=\"\",\"\",INDEX(Objednavka!A:J,60,10))","v":""}]
[null,{"$f":"IF(INDEX(Objednavka!A:I,61,3)=\"\",INDEX(Objednavka!A:I,61,1),INDEX(Objednavka!A:I,61,3))","v":"Guatemala SHB EP Santa Rosa - 5 Kg"},null,null,null,null,null,{"$f":"INDEX(Objednavka!A:I,61,4)","v":1178},null,{"$f":"INDEX(Objednavka!A:I,61,5)","v":1354.6999999999998},{"$f":"INDEX(Objednavka!A:I,61,7)","v":0},{"$f":"INDEX(Objednavka!A:I,61,8)","v":0},null,{"$f":"IF(INDEX(Objednavka!A:J,61,10)=\"\",\"\",INDEX(Objednavka!A:J,61,10))","v":""}]
[null,{"$f":"IF(INDEX(Objednavka!A:I,62,3)=\"\",INDEX(Objednavka!A:I,62,1),INDEX(Objednavka!A:I,62,3))","v":"Guatemala SHB EP Santa Rosa - 10 Kg"},null,null,null,null,null,{"$f":"INDEX(Objednavka!A:I,62,4)","v":2070},null,{"$f":"INDEX(Objednavka!A:I,62,5)","v":2380.5},{"$f":"INDEX(Objednavka!A:I,62,7)","v":0},{"$f":"INDEX(Objednavka!A:I,62,8)","v":0},null,{"$f":"IF(INDEX(Objednavka!A:J,62,10)=\"\",\"\",INDEX(Objednavka!A:J,62,10))","v":""}]
[null,{"$f":"IF(INDEX(Objednavka!A:I,63,3)=\"\",INDEX(Objednavka!A:I,63,1),INDEX(Objednavka!A:I,63,3))","v":"Guatemala SHB EP Santa Rosa - 20 Kg"},null,null,null,null,null,{"$f":"INDEX(Objednavka!A:I,63,4)","v":3687},null,{"$f":"INDEX(Objednavka!A:I,63,5)","v":4240.0499999999993},{"$f":"INDEX(Objednavka!A:I,63,7)","v":0},{"$f":"INDEX(Objednavka!A:I,63,8)","v":0},null,{"$f":"IF(INDEX(Objednavka!A:J,63,10)=\"\",\"\",INDEX(Objednavka!A:J,63,10))","v":""}]
[null,{"$f":"IF(INDEX(Objednavka!A:I,64,3)=\"\",INDEX(Objednavka!A:I,64,1),INDEX(Objednavka!A:I,64,3))","v":"Guatemala SHB EP Santa Rosa - 40 Kg"},null,null,null,null,null,{"$f":"INDEX(Objednavka!A:I,64,4)","v":6643},null,{"$f":"INDEX(Objednavka!A:I,64,5)","v":7639.45},{"$f":"INDEX(Objednavka!A:I,64,7)","v":0},{"$f":"INDEX(Objednavka!A:I,64,8)","v":0},null,{"$f":"IF(INDEX(Objednavka!A:J,64,10)=\"\",\"\",INDEX(Objednavka!A:J,64,10))","v":""}]
[null,{"$f":"IF(INDEX(Objednavka!A:I,65,3)=\"\",INDEX(Objednavka!A:I,65,1),INDEX(Objednavka!A:I,65,3))","v":"Guatemala SHB EP Santa Rosa - 69 Kg"},null,null,null,null,null,{"$f":"INDEX(Objednavka!A:I,65,4)","v":10440},null,{"$f":"INDEX(Objednavka!A:I,65,5)","v":12005.999999999998},{"$f":"INDEX(Objednavka!A:I,65,7)","v":0},{"$f":"INDEX(Objednavka!A:I,65,8)","v":0},null,{"$f":"IF(INDEX(Objednavka!A:J,65,10)=\"\",\"\",INDEX(Objednavka!A:J,65,10))","v":""}]
[null,{"$f":"IF(INDEX(Objednavka!A:I,66,3)=\"\",INDEX(Objednavka!A:I,66,1),INDEX(Objednavka!A:I,66,3))","v":"Guatemala SHB EP Santa Rosa - 69 Kg - min. odběr 10 pytlů"},null,null,null,null,null,{"$f":"INDEX(Objednavka!A:I,66,4)","v":9720},null,{"$f":"INDEX(Objednavka!A:I,66,5)","v":11178},{"$f":"INDEX(Objednavka!A:I,66,7)","v":0},{"$f":"INDEX(Objednavka!A:I,66,8)","v":0},null,{"$f":"IF(INDEX(Objednavka!A:J,66,10)=\"\",\"\",INDEX(Objednavka!A:J,66,10))","v":""}]
[null,{"$f":"IF(INDEX(Objednavka!A:I,67,3)=\"\",INDEX(Objednavka!A:I,67,1),INDEX(Objednavka!A:I,67,3))","v":"Hawaii Kona - 1 Kg"},null,null,null,null,null,{"$f":"INDEX(Objednavka!A:I,67,4)","v":2184},null,{"$f":"INDEX(Objednavka!A:I,67,5)","v":2511.6},{"$f":"INDEX(Objednavka!A:I,67,7)","v":0},{"$f":"INDEX(Objednavka!A:I,67,8)","v":0},null,{"$f":"IF(INDEX(Objednavka!A:J,67,10)=\"\",\"\",INDEX(Objednavka!A:J,67,10))","v":""}]
[null,{"$f":"IF(INDEX(Objednavka!A:I,68,3)=\"\",INDEX(Objednavka!A:I,68,1),INDEX(Objednavka!A:I,68,3))","v":"Hawaii Kona - 5 Kg"},null,null,null,null,null,{"$f":"INDEX(Objednavka!A:I,68,4)","v":9396},null,{"$f":"INDEX(Objednavka!A:I,68,5)","v":10805.4},{"$f":"INDEX(Objednavka!A:I,68,7)","v":0},{"$f":"INDEX(Objednavka!A:I,68,8)","v":0},null,{"$f":"IF(INDEX(Objednavka!A:J,68,10)=\"\",\"\",INDEX(Objednavka!A:J,68,10))","v":""}]
[null,{"$f":"IF(INDEX(Objednavka!A:I,69,3)=\"\",INDEX(Objednavka!A:I,69,1),INDEX(Objednavka!A:I,69,3))","v":"Hawaii Kona - 10 Kg"},null,null,null,null,null,{"$f":"INDEX(Objednavka!A:I,69,4)","v":16487},null,{"$f":"INDEX(Objednavka!A:I,69,5)","v":18960.05},{"$f":"INDEX(Objednavka!A:I,69,7)","v":0},{"$f":"INDEX(Objednavka!A:I,69,8)","v":0},null,{"$f":"IF(INDEX(Objednavka!A:J,69,10)=\"\",\"\",INDEX(Objednavka!A:J,69,10))","v":""}]
[null,{"$f":"IF(INDEX(Objednavka!A:I,70,3)=\"\",INDEX(Objednavka!A:I,70,1),INDEX(Objednavka!A:I,70,3))","v":"Hawaii Kona - 20 Kg"},null,null,null,null,null,{"$f":"INDEX(Objednavka!A:I,70,4)","v":29374},null,{"$f":"INDEX(Objednavka!A:I,70,5)","v":33780.1},{"$f":"INDEX(Objednavka!A:I,70,7)","v":0},{"$f":"INDEX(Objednavka!A:I,70,8)","v":0},null,{"$f":"IF(INDEX(Objednavka!A:J,70,10)=\"\",\"\",INDEX(Objednavka!A:J,70,10))","v":""}]
[null,{"$f":"IF(INDEX(Objednavka!A:I,71,3)=\"\",INDEX(Objednavka!A:I,71,1),INDEX(Objednavka!A:I,71,3))","v":"Hawaii Kona - 40 Kg"},null,null,null,null,null,{"$f":"INDEX(Objednavka!A:I,71,4)","v":52974},null,{"$f":"INDEX(Objednavka!A:I,71,5)","v":60920.1},{"$f":"INDEX(Objednavka!A:I,71,7)","v":0},{"$f":"INDEX(Objednavka!A:I,71,8)","v":0},null,{"$f":"IF(INDEX(Objednavka!A:J,71,10)=\"\",\"\",INDEX(Objednavka!A:J,71,10))","v":""}]
[null,{"$f":"IF(INDEX(Objednavka!A:I,72,3)=\"\",INDEX(Objednavka!A:I,72,1),INDEX(Objednavka!A:I,72,3))","v":"Hawaii Kona - 60 Kg"},null,null,null,null,null,{"$f":"INDEX(Objednavka!A:I,72,4)","v":72313},null,{"$f":"INDEX(Objednavka!A:I,72,5)","v":83159.95},{"$f":"INDEX(Objednavka!A:I,72,7)","v":0},{"$f":"INDEX(Objednavka!A:I,72,8)","v":0},null,{"$f":"IF(INDEX(Objednavka!A:J,72,10)=\"\",\"\",INDEX(Objednavka!A:J,72,10))","v":""}]
[null,{"$f":"IF(INDEX(Objednavka!A:I,73,3)=\"\",INDEX(Objednavka!A:I,73,1),INDEX(Objednavka!A:I,73,3))","v":"Hawaii Kona - 60 Kg - min. odběr 10 pytlů"},null,null,null,null,null,{"$f":"INDEX(Objednavka!A:I,73,4)","v":67304},null,{"$f":"INDEX(Objednavka!A:I,73,5)","v":77399.599999999991},{"$f":"INDEX(Objednavka!A:I,73,7)","v":0},{"$f":"INDEX(Objednavka!A:I,73,8)","v":0},null,{"$f":"IF(INDEX(Objednavka!A:J,73,10)=\"\",\"\",INDEX(Objednavka!A:J,73,10))","v":""}]
[null,{"$f":"IF(INDEX(Objednavka!A:I,74,3)=\"\",INDEX(Objednavka!A:I,74,1),INDEX(Objednavka!A:I,74,3))","v":"Honduras SHG EP - 1 Kg"},null,null,null,null,null,{"$f":"INDEX(Objednavka!A:I,74,4)","v":224},null,{"$f":"INDEX(Objednavka!A:I,74,5)","v":257.59999999999997},{"$f":"INDEX(Objednavka!A:I,74,7)","v":0},{"$f":"INDEX(Objednavka!A:I,74,8)","v":0},null,{"$f":"IF(INDEX(Objednavka!A:J,74,10)=\"\",\"\",INDEX(Objednavka!A:J,74,10))","v":""}]
[null,{"$f":"IF(INDEX(Objednavka!A:I,75,3)=\"\",INDEX(Objednavka!A:I,75,1),INDEX(Objednavka!A:I,75,3))","v":"Honduras SHG EP - 5 Kg"},null,null,null,null,null,{"$f":"INDEX(Objednavka!A:I,75,4)","v":965},null,{"$f":"INDEX(Objednavka!A:I,75,5)","v":1109.75},{"$f":"INDEX(Objednavka!A:I,75,7)","v":0},{"$f":"INDEX(Objednavka!A:I,75,8)","v":0},null,{"$f":"IF(INDEX(Objednavka!A:J,75,10)=\"\",\"\",INDEX(Objednavka!A:J,75,10))","v":""}]
[null,{"$f":"IF(INDEX(Objednavka!A:I,76,3)=\"\",INDEX(Objednavka!A:I,76,1),INDEX(Objednavka!A:I,76,3))","v":"Honduras SHG EP - 10 Kg"},null,null,null,null,null,{"$f":"INDEX(Objednavka!A:I,76,4)","v":1696},null,{"$f":"INDEX(Objednavka!A:I,76,5)","v":1950.3999999999999},{"$f":"INDEX(Objednavka!A:I,76,7)","v":0},{"$f":"INDEX(Objednavka!A:I,76,8)","v":0},null,{"$f":"IF(INDEX(Objednavka!A:J,76,10)=\"\",\"\",INDEX(Objednavka!A:J,76,10))","v":""}]
[null,{"$f":"IF(INDEX(Objednavka!A:I,77,3)=\"\",INDEX(Objednavka!A:I,77,1),INDEX(Objednavka!A:I,77,3))","v":"Honduras SHG EP - 20 Kg"},null,null,null,null,null,{"$f":"INDEX(Objednavka!A:I,77,4)","v":3026},null,{"$f":"INDEX(Objednavka!A:I,77,5)","v":3479.8999999999996},{"$f":"INDEX(Objednavka!A:I,77,7)","v":0},{"$f":"INDEX(Objednavka!A:I,77,8)","v":0},null,{"$f":"IF(INDEX(Objednavka!A:J,77,10)=\"\",\"\",INDEX(Objednavka!A:J,77,10))","v":""}]
[null,{"$f":"IF(INDEX(Objednavka!A:I,78,3)=\"\",INDEX(Objednavka!A:I,78,1),INDEX(Objednavka!A:I,78,3))","v":"Honduras SHG EP - 40 Kg"},null,null,null,null,null,{"$f":"INDEX(Objednavka!A:I,78,4)","v":5461},null,{"$f":"INDEX(Objednavka!A:I,78,5)","v":6280.15},{"$f":"INDEX(Objednavka!A:I,78,7)","v":0},{"$f":"INDEX(Objednavka!A:I,78,8)","v":0},null,{"$f":"IF(INDEX(Objednavka!A:J,78,10)=\"\",\"\",INDEX(Objednavka!A:J,78,10))","v":""}]
[null,{"$f":"IF(INDEX(Objednavka!A:I,79,3)=\"\",INDEX(Objednavka!A:I,79,1),INDEX(Objednavka!A:I,79,3))","v":"Honduras SHG EP - 69 Kg"},null,null,null,null,null,{"$f":"INDEX(Objednavka!A:I,79,4)","v":8580},null,{"$f":"INDEX(Objednavka!A:I,79,5)","v":9867},{"$f":"INDEX(Objednavka!A:I,79,7)","v":0},{"$f":"INDEX(Objednavka!A:I,79,8)","v":0},null,{"$f":"IF(INDEX(Objednavka!A:J,79,10)=\"\",\"\",INDEX(Objednavka!A:J,79,10))","v":""}]
[null,{"$f":"IF(INDEX(Objednavka!A:I,80,3)=\"\",INDEX(Objednavka!A:I,80,1),INDEX(Objednavka!A:I,80,3))","v":"Honduras SHG EP - 69 Kg - min. odběr 10 pytlů"},null,null,null,null,null,{"$f":"INDEX(Objednavka!A:I,80,4)","v":7980},null,{"$f":"INDEX(Objednavka!A:I,80,5)","v":9177},{"$f":"INDEX(Objednavka!A:I,80,7)","v":0},{"$f":"INDEX(Objednavka!A:I,80,8)","v":0},null,{"$f":"IF(INDEX(Objednavka!A:J,80,10)=\"\",\"\",INDEX(Objednavka!A:J,80,10))","v":""}]
[null,{"$f":"IF(INDEX(Objednavka!A:I,81,3)=\"\",INDEX(Objednavka!A:I,81,1),INDEX(Objednavka!A:I,81,3))","v":"Indie Plantation A - 1 Kg"},null,null,null,null,null,{"$f":"INDEX(Objednavka!A:I,81,4)","v":271},null,{"$f":"INDEX(Objednavka!A:I,81,5)","v":311.64999999999998},{"$f":"INDEX(Objednavka!A:I,81,7)","v":0},{"$f":"INDEX(Objednavka!A:I,81,8)","v":0},null,{"$f":"IF(INDEX(Objednavka!A:J,81,10)=\"\",\"\",INDEX(Objednavka!A:J,81,10))","v":""}]
[null,{"$f":"IF(INDEX(Objednavka!A:I,82,3)=\"\",INDEX(Objednavka!A:I,82,1),INDEX(Objednavka!A:I,82,3))","v":"Indie Plantation A - 5 Kg"},null,null,null,null,null,{"$f":"INDEX(Objednavka!A:I,82,4)","v":1170},null,{"$f":"INDEX(Objednavka!A:I,82,5)","v":1345.5},{"$f":"INDEX(Objednavka!A:I,82,7)","v":0},{"$f":"INDEX(Objednavka!A:I,82,8)","v":0},null,{"$f":"IF(INDEX(Objednavka!A:J,82,10)=\"\",\"\",INDEX(Objednavka!A:J,82,10))","v":""}]
[null,{"$f":"IF(INDEX(Objednavka!A:I,83,3)=\"\",INDEX(Objednavka!A:I,83,1),INDEX(Objednavka!A:I,83,3))","v":"Indie Plantation A - 10 Kg"},null,null,null,null,null,{"$f":"INDEX(Objednavka!A:I,83,4)","v":2052},null,{"$f":"INDEX(Objednavka!A:I,83,5)","v":2359.7999999999997},{"$f":"INDEX(Objednavka!A:I,83,7)","v":0},{"$f":"INDEX(Objednavka!A:I,83,8)","v":0},null,{"$f":"IF(INDEX(Objednavka!A:J,83,10)=\"\",\"\",INDEX(Objednavka!A:J,83,10))","v":""}]
[null,{"$f":"IF(INDEX(Objednavka!A:I,84,3)=\"\",INDEX(Objednavka!A:I,84,1),INDEX(Objednavka!A:I,84,3))","v":"Indie Plantation A - 20 Kg"},null,null,null,null,null,{"$f":"INDEX(Objednavka!A:I,84,4)","v":3652},null,{"$f":"INDEX(Objednavka!A:I,84,5)","v":4199.7999999999993},{"$f":"INDEX(Objednavka!A:I,84,7)","v":0},{"$f":"INDEX(Objednavka!A:I,84,8)","v":0},null,{"$f":"IF(INDEX(Objednavka!A:J,84,10)=\"\",\"\",INDEX(Objednavka!A:J,84,10))","v":""}]
[null,{"$f":"IF(INDEX(Objednavka!A:I,85,3)=\"\",INDEX(Objednavka!A:I,85,1),INDEX(Objednavka!A:I,85,3))","v":"Indie Plantation A - 40 Kg"},null,null,null,null,null,{"$f":"INDEX(Objednavka!A:I,85,4)","v":6609},null,{"$f":"INDEX(Objednavka!A:I,85,5)","v":7600.3499999999995},{"$f":"INDEX(Objednavka!A:I,85,7)","v":0},{"$f":"INDEX(Objednavka!A:I,85,8)","v":0},null,{"$f":"IF(INDEX(Objednavka!A:J,85,10)=\"\",\"\",INDEX(Objednavka!A:J,85,10))","v":""}]
[null,{"$f":"IF(INDEX(Objednavka!A:I,86,3)=\"\",INDEX(Objednavka!A:I,86,1),INDEX(Objednavka!A:I,86,3))","v":"Indie Plantation A - 60 Kg"},null,null,null,null,null,{"$f":"INDEX(Objednavka!A:I,86,4)","v":9026},null,{"$f":"INDEX(Objednavka!A:I,86,5)","v":10379.9},{"$f":"INDEX(Objednavka!A:I,86,7)","v":0},{"$f":"INDEX(Objednavka!A:I,86,8)","v":0},null,{"$f":"IF(INDEX(Objednavka!A:J,86,10)=\"\",\"\",INDEX(Objednavka!A:J,86,10))","v":""}]
[null,{"$f":"IF(INDEX(Objednavka!A:I,87,3)=\"\",INDEX(Objednavka!A:I,87,1),INDEX(Objednavka!A:I,87,3))","v":"Indie Plantation A - 60 Kg - min. odběr 10 pytlů"},null,null,null,null,null,{"$f":"INDEX(Objednavka!A:I,87,4)","v":8400},null,{"$f":"INDEX(Objednavka!A:I,87,5)","v":9660},{"$f":"INDEX(Objednavka!A:I,87,7)","v":0},{"$f":"INDEX(Objednavka!A:I,87,8)","v":0},null,{"$f":"IF(INDEX(Objednavka!A:J,87,10)=\"\",\"\",INDEX(Objednavka!A:J,87,10))","v":""}]
[null,{"$f":"IF(INDEX(Objednavka!A:I,88,3)=\"\",INDEX(Objednavka!A:I,88,1),INDEX(Objednavka!A:I,88,3))","v":"Indie Monsooned Malabar - 1 Kg"},null,null,null,null,null,{"$f":"INDEX(Objednavka!A:I,88,4)","v":288},null,{"$f":"INDEX(Objednavka!A:I,88,5)","v":331.2},{"$f":"INDEX(Objednavka!A:I,88,7)","v":0},{"$f":"INDEX(Objednavka!A:I,88,8)","v":0},null,{"$f":"IF(INDEX(Objednavka!A:J,88,10)=\"\",\"\",INDEX(Objednavka!A:J,88,10))","v":""}]
[null,{"$f":"IF(INDEX(Objednavka!A:I,89,3)=\"\",INDEX(Objednavka!A:I,89,1),INDEX(Objednavka!A:I,89,3))","v":"Indie Monsooned Malabar - 5 Kg"},null,null,null,null,null,{"$f":"INDEX(Objednavka!A:I,89,4)","v":1235},null,{"$f":"INDEX(Objednavka!A:I,89,5)","v":1420.25},{"$f":"INDEX(Objednavka!A:I,89,7)","v":0},{"$f":"INDEX(Objednavka!A:I,89,8)","v":0},null,{"$f":"IF(INDEX(Objednavka!A:J,89,10)=\"\",\"\",INDEX(Objednavka!A:J,89,10))","v":""}]
[null,{"$f":"IF(INDEX(Objednavka!A:I,90,3)=\"\",INDEX(Objednavka!A:I,90,1),INDEX(Objednavka!A:I,90,3))","v":"Indie Monsooned Malabar - 10 Kg"},null,null,null,null,null,{"$f":"INDEX(Objednavka!A:I,90,4)","v":2174},null,{"$f":"INDEX(Objednavka!A:I,90,5)","v":2500.1},{"$f":"INDEX(Objednavka!A:I,90,7)","v":0},{"$f":"INDEX(Objednavka!A:I,90,8)","v":0},null,{"$f":"IF(INDEX(Objednavka!A:J,90,10)=\"\",\"\",INDEX(Objednavka!A:J,90,10))","v":""}]
[null,{"$f":"IF(INDEX(Objednavka!A:I,91,3)=\"\",INDEX(Objednavka!A:I,91,1),INDEX(Objednavka!A:I,91,3))","v":"Indie Monsooned Malabar - 20 Kg"},null,null,null,null,null,{"$f":"INDEX(Objednavka!A:I,91,4)","v":3861},null,{"$f":"INDEX(Objednavka!A:I,91,5)","v":4440.1499999999996},{"$f":"INDEX(Objednavka!A:I,91,7)","v":0},{"$f":"INDEX(Objednavka!A:I,91,8)","v":0},null,{"$f":"IF(INDEX(Objednavka!A:J,91,10)=\"\",\"\",INDEX(Objednavka!A:J,91,10))","v":""}]
[null,{"$f":"IF(INDEX(Objednavka!A:I,92,3)=\"\",INDEX(Objednavka!A:I,92,1),INDEX(Objednavka!A:I,92,3))","v":"Indie Monsooned Malabar - 40 Kg"},null,null,null,null,null,{"$f":"INDEX(Objednavka!A:I,92,4)","v":6991},null,{"$f":"INDEX(Objednavka!A:I,92,5)","v":8039.65},{"$f":"INDEX(Objednavka!A:I,92,7)","v":0},{"$f":"INDEX(Objednavka!A:I,92,8)","v":0},null,{"$f":"IF(INDEX(Objednavka!A:J,92,10)=\"\",\"\",INDEX(Objednavka!A:J,92,10))","v":""}]
[null,{"$f":"IF(INDEX(Objednavka!A:I,93,3)=\"\",INDEX(Objednavka!A:I,93,1),INDEX(Objednavka!A:I,93,3))","v":"Indie Monsooned Malabar - 50 Kg"},null,null,null,null,null,{"$f":"INDEX(Objednavka!A:I,93,4)","v":7957},null,{"$f":"INDEX(Objednavka!A:I,93,5)","v":9150.5499999999993},{"$f":"INDEX(Objednavka!A:I,93,7)","v":0},{"$f":"INDEX(Objednavka!A:I,93,8)","v":0},null,{"$f":"IF(INDEX(Objednavka!A:J,93,10)=\"\",\"\",INDEX(Objednavka!A:J,93,10))","v":""}]
[null,{"$f":"IF(INDEX(Objednavka!A:I,94,3)=\"\",INDEX(Objednavka!A:I,94,1),INDEX(Objednavka!A:I,94,3))","v":"Indie Monsooned Malabar - 50 Kg - min. odběr 10 pytlů"},null,null,null,null,null,{"$f":"INDEX(Objednavka!A:I,94,4)","v":7392},null,{"$f":"INDEX(Objednavka!A:I,94,5)","v":8500.7999999999993},{"$f":"INDEX(Objednavka!A:I,94,7)","v":0},{"$f":"INDEX(Objednavka!A:I,94,8)","v":0},null,{"$f":"IF(INDEX(Objednavka!A:J,94,10)=\"\",\"\",INDEX(Objednavka!A:J,94,10))","v":""}]
[null,{"$f":"IF(INDEX(Objednavka!A:I,95,3)=\"\",INDEX(Objednavka!A:I,95,1),INDEX(Objednavka!A:I,95,3))","v":"Indonésie Sulawesi Kalossi - Benteng Alla Grade 1 - 1 Kg"},null,null,null,null,null,{"$f":"INDEX(Objednavka!A:I,95,4)","v":380},null,{"$f":"INDEX(Objednavka!A:I,95,5)","v":436.99999999999994},{"$f":"INDEX(Objednavka!A:I,95,7)","v":0},{"$f":"INDEX(Objednavka!A:I,95,8)","v":0},null,{"$f":"IF(INDEX(Objednavka!A:J,95,10)=\"\",\"\",INDEX(Objednavka!A:J,95,10))","v":""}]
[null,{"$f":"IF(INDEX(Objednavka!A:I,96,3)=\"\",INDEX(Objednavka!A:I,96,1),INDEX(Objednavka!A:I,96,3))","v":"Indonésie Sulawesi Kalossi - Benteng Alla Grade 1 - 5 Kg"},null,null,null,null,null,{"$f":"INDEX(Objednavka!A:I,96,4)","v":1635},null,{"$f":"INDEX(Objednavka!A:I,96,5)","v":1880.2499999999998},{"$f":"INDEX(Objednavka!A:I,96,7)","v":0},{"$f":"INDEX(Objednavka!A:I,96,8)","v":0},null,{"$f":"IF(INDEX(Objednavka!A:J,96,10)=\"\",\"\",INDEX(Objednavka!A:J,96,10))","v":""}]
[null,{"$f":"IF(INDEX(Objednavka!A:I,97,3)=\"\",INDEX(Objednavka!A:I,97,1),INDEX(Objednavka!A:I,97,3))","v":"Indonésie Sulawesi Kalossi - Benteng Alla Grade 1 - 10 Kg"},null,null,null,null,null,{"$f":"INDEX(Objednavka!A:I,97,4)","v":2870},null,{"$f":"INDEX(Objednavka!A:I,97,5)","v":3300.4999999999995},{"$f":"INDEX(Objednavka!A:I,97,7)","v":0},{"$f":"INDEX(Objednavka!A:I,97,8)","v":0},null,{"$f":"IF(INDEX(Objednavka!A:J,97,10)=\"\",\"\",INDEX(Objednavka!A:J,97,10))","v":""}]
[null,{"$f":"IF(INDEX(Objednavka!A:I,98,3)=\"\",INDEX(Objednavka!A:I,98,1),INDEX(Objednavka!A:I,98,3))","v":"Indonésie Sulawesi Kalossi - Benteng Alla Grade 1 - 20 Kg"},null,null,null,null,null,{"$f":"INDEX(Objednavka!A:I,98,4)","v":5113},null,{"$f":"INDEX(Objednavka!A:I,98,5)","v":5879.95},{"$f":"INDEX(Objednavka!A:I,98,7)","v":0},{"$f":"INDEX(Objednavka!A:I,98,8)","v":0},null,{"$f":"IF(INDEX(Objednavka!A:J,98,10)=\"\",\"\",INDEX(Objednavka!A:J,98,10))","v":""}]
[null,{"$f":"IF(INDEX(Objednavka!A:I,99,3)=\"\",INDEX(Objednavka!A:I,99,1),INDEX(Objednavka!A:I,99,3))","v":"Indonésie Sulawesi Kalossi - Benteng Alla Grade 1 - 40 Kg"},null,null,null,null,null,{"$f":"INDEX(Objednavka!A:I,99,4)","v":9217},null,{"$f":"INDEX(Objednavka!A:I,99,5)","v":10599.55},{"$f":"INDEX(Objednavka!A:I,99,7)","v":0},{"$f":"INDEX(Objednavka!A:I,99,8)","v":0},null,{"$f":"IF(INDEX(Objednavka!A:J,99,10)=\"\",\"\",INDEX(Objednavka!A:J,99,10))","v":""}]
[null,{"$f":"IF(INDEX(Objednavka!A:I,100,3)=\"\",INDEX(Objednavka!A:I,100,1),INDEX(Objednavka!A:I,100,3))","v":"Indonésie Sulawesi Kalossi - Benteng Alla Grade 1 - 60 Kg"},null,null,null,null,null,{"$f":"INDEX(Objednavka!A:I,100,4)","v":12574},null,{"$f":"INDEX(Objednavka!A:I,100,5)","v":14460.099999999999},{"$f":"INDEX(Objednavka!A:I,100,7)","v":0},{"$f":"INDEX(Objednavka!A:I,100,8)","v":0},null,{"$f":"IF(INDEX(Objednavka!A:J,100,10)=\"\",\"\",INDEX(Objednavka!A:J,100,10))","v":""}]
[null,{"$f":"IF(INDEX(Objednavka!A:I,101,3)=\"\",INDEX(Objednavka!A:I,101,1),INDEX(Objednavka!A:I,101,3))","v":"Indonésie Sulawesi Kalossi - Benteng Alla Grade 1 - 60 Kg - min. odběr 10 pytlů"},null,null,null,null,null,{"$f":"INDEX(Objednavka!A:I,101,4)","v":11739},null,{"$f":"INDEX(Objednavka!A:I,101,5)","v":13499.849999999999},{"$f":"INDEX(Objednavka!A:I,101,7)","v":0},{"$f":"INDEX(Objednavka!A:I,101,8)","v":0},null,{"$f":"IF(INDEX(Objednavka!A:J,101,10)=\"\",\"\",INDEX(Objednavka!A:J,101,10))","v":""}]
[null,{"$f":"IF(INDEX(Objednavka!A:I,102,3)=\"\",INDEX(Objednavka!A:I,102,1),INDEX(Objednavka!A:I,102,3))","v":"Keňa AA Plus - 1 Kg"},null,null,null,null,null,{"$f":"INDEX(Objednavka!A:I,102,4)","v":416},null,{"$f":"INDEX(Objednavka!A:I,102,5)","v":478.4},{"$f":"INDEX(Objednavka!A:I,102,7)","v":0},{"$f":"INDEX(Objednavka!A:I,102,8)","v":0},null,{"$f":"IF(INDEX(Objednavka!A:J,102,10)=\"\",\"\",INDEX(Objednavka!A:J,102,10))","v":""}]
[null,{"$f":"IF(INDEX(Objednavka!A:I,103,3)=\"\",INDEX(Objednavka!A:I,103,1),INDEX(Objednavka!A:I,103,3))","v":"Keňa AA Plus - 5 Kg"},null,null,null,null,null,{"$f":"INDEX(Objednavka!A:I,103,4)","v":1787},null,{"$f":"INDEX(Objednavka!A:I,103,5)","v":2055.0499999999997},{"$f":"INDEX(Objednavka!A:I,103,7)","v":0},{"$f":"INDEX(Objednavka!A:I,103,8)","v":0},null,{"$f":"IF(INDEX(Objednavka!A:J,103,10)=\"\",\"\",INDEX(Objednavka!A:J,103,10))","v":""}]
[null,{"$f":"IF(INDEX(Objednavka!A:I,104,3)=\"\",INDEX(Objednavka!A:I,104,1),INDEX(Objednavka!A:I,104,3))","v":"Keňa AA Plus - 10 Kg"},null,null,null,null,null,{"$f":"INDEX(Objednavka!A:I,104,4)","v":3139},null,{"$f":"INDEX(Objednavka!A:I,104,5)","v":3609.85},{"$f":"INDEX(Objednavka!A:I,104,7)","v":0},{"$f":"INDEX(Objednavka!A:I,104,8)","v":0},null,{"$f":"IF(INDEX(Objednavka!A:J,104,10)=\"\",\"\",INDEX(Objednavka!A:J,104,10))","v":""}]
[null,{"$f":"IF(INDEX(Objednavka!A:I,105,3)=\"\",INDEX(Objednavka!A:I,105,1),INDEX(Objednavka!A:I,105,3))","v":"Keňa AA Plus - 20 Kg"},null,null,null,null,null,{"$f":"INDEX(Objednavka!A:I,105,4)","v":5600},null,{"$f":"INDEX(Objednavka!A:I,105,5)","v":6439.9999999999991},{"$f":"INDEX(Objednavka!A:I,105,7)","v":0},{"$f":"INDEX(Objednavka!A:I,105,8)","v":0},null,{"$f":"IF(INDEX(Objednavka!A:J,105,10)=\"\",\"\",INDEX(Objednavka!A:J,105,10))","v":""}]
[null,{"$f":"IF(INDEX(Objednavka!A:I,106,3)=\"\",INDEX(Objednavka!A:I,106,1),INDEX(Objednavka!A:I,106,3))","v":"Keňa AA Plus - 40 Kg"},null,null,null,null,null,{"$f":"INDEX(Objednavka!A:I,106,4)","v":10087},null,{"$f":"INDEX(Objednavka!A:I,106,5)","v":11600.05},{"$f":"INDEX(Objednavka!A:I,106,7)","v":0},{"$f":"INDEX(Objednavka!A:I,106,8)","v":0},null,{"$f":"IF(INDEX(Objednavka!A:J,106,10)=\"\",\"\",INDEX(Objednavka!A:J,106,10))","v":""}]
[null,{"$f":"IF(INDEX(Objednavka!A:I,107,3)=\"\",INDEX(Objednavka!A:I,107,1),INDEX(Objednavka!A:I,107,3))","v":"Keňa AA Plus - 60 Kg"},null,null,null,null,null,{"$f":"INDEX(Objednavka!A:I,107,4)","v":13774},null,{"$f":"INDEX(Objednavka!A:I,107,5)","v":15840.099999999999},{"$f":"INDEX(Objednavka!A:I,107,7)","v":0},{"$f":"INDEX(Objednavka!A:I,107,8)","v":0},null,{"$f":"IF(INDEX(Objednavka!A:J,107,10)=\"\",\"\",INDEX(Objednavka!A:J,107,10))","v":""}]
[null,{"$f":"IF(INDEX(Objednavka!A:I,108,3)=\"\",INDEX(Objednavka!A:I,108,1),INDEX(Objednavka!A:I,108,3))","v":"Keňa AA Plus - 60 Kg - min. odběr 10 pytlů"},null,null,null,null,null,{"$f":"INDEX(Objednavka!A:I,108,4)","v":12834},null,{"$f":"INDEX(Objednavka!A:I,108,5)","v":14759.099999999999},{"$f":"INDEX(Objednavka!A:I,108,7)","v":0},{"$f":"INDEX(Objednavka!A:I,108,8)","v":0},null,{"$f":"IF(INDEX(Objednavka!A:J,108,10)=\"\",\"\",INDEX(Objednavka!A:J,108,10))","v":""}]
[null,{"$f":"IF(INDEX(Objednavka!A:I,109,3)=\"\",INDEX(Objednavka!A:I,109,1),INDEX(Objednavka!A:I,109,3))","v":"Kolumbie Excelso Maragogype – Finca el Boton - 1 Kg"},null,null,null,null,null,{"$f":"INDEX(Objednavka!A:I,109,4)","v":730},null,{"$f":"INDEX(Objednavka!A:I,109,5)","v":839.49999999999989},{"$f":"INDEX(Objednavka!A:I,109,7)","v":0},{"$f":"INDEX(Objednavka!A:I,109,8)","v":0},null,{"$f":"IF(INDEX(Objednavka!A:J,109,10)=\"\",\"\",INDEX(Objednavka!A:J,109,10))","v":""}]
[null,{"$f":"IF(INDEX(Objednavka!A:I,110,3)=\"\",INDEX(Objednavka!A:I,110,1),INDEX(Objednavka!A:I,110,3))","v":"Kolumbie Excelso Maragogype – Finca el Boton - 5 Kg"},null,null,null,null,null,{"$f":"INDEX(Objednavka!A:I,110,4)","v":3140},null,{"$f":"INDEX(Objednavka!A:I,110,5)","v":3610.9999999999995},{"$f":"INDEX(Objednavka!A:I,110,7)","v":0},{"$f":"INDEX(Objednavka!A:I,110,8)","v":0},null,{"$f":"IF(INDEX(Objednavka!A:J,110,10)=\"\",\"\",INDEX(Objednavka!A:J,110,10))","v":""}]
[null,{"$f":"IF(INDEX(Objednavka!A:I,111,3)=\"\",INDEX(Objednavka!A:I,111,1),INDEX(Objednavka!A:I,111,3))","v":"Kolumbie Excelso Maragogype – Finca el Boton - 10 Kg"},null,null,null,null,null,{"$f":"INDEX(Objednavka!A:I,111,4)","v":5510},null,{"$f":"INDEX(Objednavka!A:I,111,5)","v":6336.4999999999991},{"$f":"INDEX(Objednavka!A:I,111,7)","v":0},{"$f":"INDEX(Objednavka!A:I,111,8)","v":0},null,{"$f":"IF(INDEX(Objednavka!A:J,111,10)=\"\",\"\",INDEX(Objednavka!A:J,111,10))","v":""}]
[null,{"$f":"IF(INDEX(Objednavka!A:I,112,3)=\"\",INDEX(Objednavka!A:I,112,1),INDEX(Objednavka!A:I,112,3))","v":"Kolumbie Excelso Maragogype – Finca el Boton - 20 Kg"},null,null,null,null,null,{"$f":"INDEX(Objednavka!A:I,112,4)","v":9820},null,{"$f":"INDEX(Objednavka!A:I,112,5)","v":11293},{"$f":"INDEX(Objednavka!A:I,112,7)","v":0},{"$f":"INDEX(Objednavka!A:I,112,8)","v":0},null,{"$f":"IF(INDEX(Objednavka!A:J,112,10)=\"\",\"\",INDEX(Objednavka!A:J,112,10))","v":""}]
[null,{"$f":"IF(INDEX(Objednavka!A:I,113,3)=\"\",INDEX(Objednavka!A:I,113,1),INDEX(Objednavka!A:I,113,3))","v":"Kolumbie Excelso Maragogype – Finca el Boton - 40 Kg"},null,null,null,null,null,{"$f":"INDEX(Objednavka!A:I,113,4)","v":17720},null,{"$f":"INDEX(Objednavka!A:I,113,5)","v":20378},{"$f":"INDEX(Objednavka!A:I,113,7)","v":0},{"$f":"INDEX(Objednavka!A:I,113,8)","v":0},null,{"$f":"IF(INDEX(Objednavka!A:J,113,10)=\"\",\"\",INDEX(Objednavka!A:J,113,10))","v":""}]
[null,{"$f":"IF(INDEX(Objednavka!A:I,114,3)=\"\",INDEX(Objednavka!A:I,114,1),INDEX(Objednavka!A:I,114,3))","v":"Kolumbie Excelso Maragogype – Finca el Boton - 60 Kg"},null,null,null,null,null,{"$f":"INDEX(Objednavka!A:I,114,4)","v":24180},null,{"$f":"INDEX(Objednavka!A:I,114,5)","v":27806.999999999996},{"$f":"INDEX(Objednavka!A:I,114,7)","v":0},{"$f":"INDEX(Objednavka!A:I,114,8)","v":0},null,{"$f":"IF(INDEX(Objednavka!A:J,114,10)=\"\",\"\",INDEX(Objednavka!A:J,114,10))","v":""}]
[null,{"$f":"IF(INDEX(Objednavka!A:I,115,3)=\"\",INDEX(Objednavka!A:I,115,1),INDEX(Objednavka!A:I,115,3))","v":"Kolumbie Excelso Maragogype – Finca el Boton - 60 Kg - min. odběr 10 pytlů"},null,null,null,null,null,{"$f":"INDEX(Objednavka!A:I,115,4)","v":22500},null,{"$f":"INDEX(Objednavka!A:I,115,5)","v":25874.999999999996},{"$f":"INDEX(Objednavka!A:I,115,7)","v":0},{"$f":"INDEX(Objednavka!A:I,115,8)","v":0},null,{"$f":"IF(INDEX(Objednavka!A:J,115,10)=\"\",\"\",INDEX(Objednavka!A:J,115,10))","v":""}]
[null,{"$f":"IF(INDEX(Objednavka!A:I,116,3)=\"\",INDEX(Objednavka!A:I,116,1),INDEX(Objednavka!A:I,116,3))","v":"Kolumbie Supremo - Medellin 17/18 - 1 Kg"},null,null,null,null,null,{"$f":"INDEX(Objednavka!A:I,116,4)","v":250},null,{"$f":"INDEX(Objednavka!A:I,116,5)","v":287.5},{"$f":"INDEX(Objednavka!A:I,116,7)","v":0},{"$f":"INDEX(Objednavka!A:I,116,8)","v":0},null,{"$f":"IF(INDEX(Objednavka!A:J,116,10)=\"\",\"\",INDEX(Objednavka!A:J,116,10))","v":""}]
[null,{"$f":"IF(INDEX(Objednavka!A:I,117,3)=\"\",INDEX(Objednavka!A:I,117,1),INDEX(Objednavka!A:I,117,3))","v":"Kolumbie Supremo - Medellin 17/18 - 5 Kg"},null,null,null,null,null,{"$f":"INDEX(Objednavka!A:I,117,4)","v":1074},null,{"$f":"INDEX(Objednavka!A:I,117,5)","v":1235.0999999999999},{"$f":"INDEX(Objednavka!A:I,117,7)","v":0},{"$f":"INDEX(Objednavka!A:I,117,8)","v":0},null,{"$f":"IF(INDEX(Objednavka!A:J,117,10)=\"\",\"\",INDEX(Objednavka!A:J,117,10))","v":""}]
[null,{"$f":"IF(INDEX(Objednavka!A:I,118,3)=\"\",INDEX(Objednavka!A:I,118,1),INDEX(Objednavka!A:I,118,3))","v":"Kolumbie Supremo - Medellin 17/18 - 10 Kg"},null,null,null,null,null,{"$f":"INDEX(Objednavka!A:I,118,4)","v":1887},null,{"$f":"INDEX(Objednavka!A:I,118,5)","v":2170.0499999999997},{"$f":"INDEX(Objednavka!A:I,118,7)","v":0},{"$f":"INDEX(Objednavka!A:I,118,8)","v":0},null,{"$f":"IF(INDEX(Objednavka!A:J,118,10)=\"\",\"\",INDEX(Objednavka!A:J,118,10))","v":""}]
[null,{"$f":"IF(INDEX(Objednavka!A:I,119,3)=\"\",INDEX(Objednavka!A:I,119,1),INDEX(Objednavka!A:I,119,3))","v":"Kolumbie Supremo - Medellin 17/18 - 20 Kg"},null,null,null,null,null,{"$f":"INDEX(Objednavka!A:I,119,4)","v":3357},null,{"$f":"INDEX(Objednavka!A:I,119,5)","v":3860.5499999999997},{"$f":"INDEX(Objednavka!A:I,119,7)","v":0},{"$f":"INDEX(Objednavka!A:I,119,8)","v":0},null,{"$f":"IF(INDEX(Objednavka!A:J,119,10)=\"\",\"\",INDEX(Objednavka!A:J,119,10))","v":""}]
[null,{"$f":"IF(INDEX(Objednavka!A:I,120,3)=\"\",INDEX(Objednavka!A:I,120,1),INDEX(Objednavka!A:I,120,3))","v":"Kolumbie Supremo - Medellin 17/18 - 40 Kg"},null,null,null,null,null,{"$f":"INDEX(Objednavka!A:I,120,4)","v":6052},null,{"$f":"INDEX(Objednavka!A:I,120,5)","v":6959.7999999999993},{"$f":"INDEX(Objednavka!A:I,120,7)","v":0},{"$f":"INDEX(Objednavka!A:I,120,8)","v":0},null,{"$f":"IF(INDEX(Objednavka!A:J,120,10)=\"\",\"\",INDEX(Objednavka!A:J,120,10))","v":""}]
[null,{"$f":"IF(INDEX(Objednavka!A:I,121,3)=\"\",INDEX(Objednavka!A:I,121,1),INDEX(Objednavka!A:I,121,3))","v":"Kolumbie Supremo - Medellin 17/18 - 70 Kg"},null,null,null,null,null,{"$f":"INDEX(Objednavka!A:I,121,4)","v":9678},null,{"$f":"INDEX(Objednavka!A:I,121,5)","v":11129.699999999999},{"$f":"INDEX(Objednavka!A:I,121,7)","v":0},{"$f":"INDEX(Objednavka!A:I,121,8)","v":0},null,{"$f":"IF(INDEX(Objednavka!A:J,121,10)=\"\",\"\",INDEX(Objednavka!A:J,121,10))","v":""}]
[null,{"$f":"IF(INDEX(Objednavka!A:I,122,3)=\"\",INDEX(Objednavka!A:I,122,1),INDEX(Objednavka!A:I,122,3))","v":"Kolumbie Supremo - Medellin 17/18 - 70 Kg - min. odběr 10 pytlů"},null,null,null,null,null,{"$f":"INDEX(Objednavka!A:I,122,4)","v":9009},null,{"$f":"INDEX(Objednavka!A:I,122,5)","v":10360.349999999999},{"$f":"INDEX(Objednavka!A:I,122,7)","v":0},{"$f":"INDEX(Objednavka!A:I,122,8)","v":0},null,{"$f":"IF(INDEX(Objednavka!A:J,122,10)=\"\",\"\",INDEX(Objednavka!A:J,122,10))","v":""}]
[null,{"$f":"IF(INDEX(Objednavka!A:I,123,3)=\"\",INDEX(Objednavka!A:I,123,1),INDEX(Objednavka!A:I,123,3))","v":"Kostarika - Tarrazu SHB EP Tucan - 1 Kg"},null,null,null,null,null,{"$f":"INDEX(Objednavka!A:I,123,4)","v":344},null,{"$f":"INDEX(Objednavka!A:I,123,5)","v":395.59999999999997},{"$f":"INDEX(Objednavka!A:I,123,7)","v":0},{"$f":"INDEX(Objednavka!A:I,123,8)","v":0},null,{"$f":"IF(INDEX(Objednavka!A:J,123,10)=\"\",\"\",INDEX(Objednavka!A:J,123,10))","v":""}]
[null,{"$f":"IF(INDEX(Objednavka!A:I,124,3)=\"\",INDEX(Objednavka!A:I,124,1),INDEX(Objednavka!A:I,124,3))","v":"Kostarika - Tarrazu SHB EP Tucan - 5 Kg"},null,null,null,null,null,{"$f":"INDEX(Objednavka!A:I,124,4)","v":1483},null,{"$f":"INDEX(Objednavka!A:I,124,5)","v":1705.4499999999998},{"$f":"INDEX(Objednavka!A:I,124,7)","v":0},{"$f":"INDEX(Objednavka!A:I,124,8)","v":0},null,{"$f":"IF(INDEX(Objednavka!A:J,124,10)=\"\",\"\",INDEX(Objednavka!A:J,124,10))","v":""}]
[null,{"$f":"IF(INDEX(Objednavka!A:I,125,3)=\"\",INDEX(Objednavka!A:I,125,1),INDEX(Objednavka!A:I,125,3))","v":"Kostarika - Tarrazu SHB EP Tucan - 10 Kg"},null,null,null,null,null,{"$f":"INDEX(Objednavka!A:I,125,4)","v":2600},null,{"$f":"INDEX(Objednavka!A:I,125,5)","v":2990},{"$f":"INDEX(Objednavka!A:I,125,7)","v":0},{"$f":"INDEX(Objednavka!A:I,125,8)","v":0},null,{"$f":"IF(INDEX(Objednavka!A:J,125,10)=\"\",\"\",INDEX(Objednavka!A:J,125,10))","v":""}]
[null,{"$f":"IF(INDEX(Objednavka!A:I,126,3)=\"\",INDEX(Objednavka!A:I,126,1),INDEX(Objednavka!A:I,126,3))","v":"Kostarika - Tarrazu SHB EP Tucan - 20 Kg"},null,null,null,null,null,{"$f":"INDEX(Objednavka!A:I,126,4)","v":4643},null,{"$f":"INDEX(Objednavka!A:I,126,5)","v":5339.45},{"$f":"INDEX(Objednavka!A:I,126,7)","v":0},{"$f":"INDEX(Objednavka!A:I,126,8)","v":0},null,{"$f":"IF(INDEX(Objednavka!A:J,126,10)=\"\",\"\",INDEX(Objednavka!A:J,126,10))","v":""}]
[null,{"$f":"IF(INDEX(Objednavka!A:I,127,3)=\"\",INDEX(Objednavka!A:I,127,1),INDEX(Objednavka!A:I,127,3))","v":"Kostarika - Tarrazu SHB EP Tucan - 40 Kg"},null,null,null,null,null,{"$f":"INDEX(Objednavka!A:I,127,4)","v":8348},null,{"$f":"INDEX(Objednavka!A:I,127,5)","v":9600.1999999999989},{"$f":"INDEX(Objednavka!A:I,127,7)","v":0},{"$f":"INDEX(Objednavka!A:I,127,8)","v":0},null,{"$f":"IF(INDEX(Objednavka!A:J,127,10)=\"\",\"\",INDEX(Objednavka!A:J,127,10))","v":""}]
[null,{"$f":"IF(INDEX(Objednavka!A:I,128,3)=\"\",INDEX(Objednavka!A:I,128,1),INDEX(Objednavka!A:I,128,3))","v":"Kostarika - Tarrazu SHB EP Tucan - 69 Kg"},null,null,null,null,null,{"$f":"INDEX(Objednavka!A:I,128,4)","v":14400},null,{"$f":"INDEX(Objednavka!A:I,128,5)","v":16560},{"$f":"INDEX(Objednavka!A:I,128,7)","v":0},{"$f":"INDEX(Objednavka!A:I,128,8)","v":0},null,{"$f":"IF(INDEX(Objednavka!A:J,128,10)=\"\",\"\",INDEX(Objednavka!A:J,128,10))","v":""}]
[null,{"$f":"IF(INDEX(Objednavka!A:I,129,3)=\"\",INDEX(Objednavka!A:I,129,1),INDEX(Objednavka!A:I,129,3))","v":"Kostarika - Tarrazu SHB EP Tucan - 69 Kg - min. odběr 10 pytlů"},null,null,null,null,null,{"$f":"INDEX(Objednavka!A:I,129,4)","v":12240},null,{"$f":"INDEX(Objednavka!A:I,129,5)","v":14075.999999999998},{"$f":"INDEX(Objednavka!A:I,129,7)","v":0},{"$f":"INDEX(Objednavka!A:I,129,8)","v":0},null,{"$f":"IF(INDEX(Objednavka!A:J,129,10)=\"\",\"\",INDEX(Objednavka!A:J,129,10))","v":""}]
[null,{"$f":"IF(INDEX(Objednavka!A:I,130,3)=\"\",INDEX(Objednavka!A:I,130,1),INDEX(Objednavka!A:I,130,3))","v":"Kostarika - Palmichal El Cedral Black Honey - 1 Kg"},null,null,null,null,null,{"$f":"INDEX(Objednavka!A:I,130,4)","v":555},null,{"$f":"INDEX(Objednavka!A:I,130,5)","v":638.25},{"$f":"INDEX(Objednavka!A:I,130,7)","v":0},{"$f":"INDEX(Objednavka!A:I,130,8)","v":0},null,{"$f":"IF(INDEX(Objednavka!A:J,130,10)=\"\",\"\",INDEX(Objednavka!A:J,130,10))","v":""}]
[null,{"$f":"IF(INDEX(Objednavka!A:I,131,3)=\"\",INDEX(Objednavka!A:I,131,1),INDEX(Objednavka!A:I,131,3))","v":"Kostarika - Palmichal El Cedral Black Honey - 5 Kg"},null,null,null,null,null,{"$f":"INDEX(Objednavka!A:I,131,4)","v":2390},null,{"$f":"INDEX(Objednavka!A:I,131,5)","v":2748.5},{"$f":"INDEX(Objednavka!A:I,131,7)","v":0},{"$f":"INDEX(Objednavka!A:I,131,8)","v":0},null,{"$f":"IF(INDEX(Objednavka!A:J,131,10)=\"\",\"\",INDEX(Objednavka!A:J,131,10))","v":""}]
[null,{"$f":"IF(INDEX(Objednavka!A:I,132,3)=\"\",INDEX(Objednavka!A:I,132,1),INDEX(Objednavka!A:I,132,3))","v":"Kostarika - Palmichal El Cedral Black Honey - 10 Kg"},null,null,null,null,null,{"$f":"INDEX(Objednavka!A:I,132,4)","v":4190},null,{"$f":"INDEX(Objednavka!A:I,132,5)","v":4818.5},{"$f":"INDEX(Objednavka!A:I,132,7)","v":0},{"$f":"INDEX(Objednavka!A:I,132,8)","v":0},null,{"$f":"IF(INDEX(Objednavka!A:J,132,10)=\"\",\"\",INDEX(Objednavka!A:J,132,10))","v":""}]
[null,{"$f":"IF(INDEX(Objednavka!A:I,133,3)=\"\",INDEX(Objednavka!A:I,133,1),INDEX(Objednavka!A:I,133,3))","v":"Kostarika - Palmichal El Cedral Black Honey - 20 Kg"},null,null,null,null,null,{"$f":"INDEX(Objednavka!A:I,133,4)","v":7460},null,{"$f":"INDEX(Objednavka!A:I,133,5)","v":8579},{"$f":"INDEX(Objednavka!A:I,133,7)","v":0},{"$f":"INDEX(Objednavka!A:I,133,8)","v":0},null,{"$f":"IF(INDEX(Objednavka!A:J,133,10)=\"\",\"\",INDEX(Objednavka!A:J,133,10))","v":""}]
[null,{"$f":"IF(INDEX(Objednavka!A:I,134,3)=\"\",INDEX(Objednavka!A:I,134,1),INDEX(Objednavka!A:I,134,3))","v":"Kostarika - Palmichal El Cedral Black Honey - 40 Kg"},null,null,null,null,null,{"$f":"INDEX(Objednavka!A:I,134,4)","v":13480},null,{"$f":"INDEX(Objednavka!A:I,134,5)","v":15501.999999999998},{"$f":"INDEX(Objednavka!A:I,134,7)","v":0},{"$f":"INDEX(Objednavka!A:I,134,8)","v":0},null,{"$f":"IF(INDEX(Objednavka!A:J,134,10)=\"\",\"\",INDEX(Objednavka!A:J,134,10))","v":""}]
[null,{"$f":"IF(INDEX(Objednavka!A:I,135,3)=\"\",INDEX(Objednavka!A:I,135,1),INDEX(Objednavka!A:I,135,3))","v":"Kostarika - Palmichal El Cedral Black Honey - 60 Kg"},null,null,null,null,null,{"$f":"INDEX(Objednavka!A:I,135,4)","v":18420},null,{"$f":"INDEX(Objednavka!A:I,135,5)","v":21183},{"$f":"INDEX(Objednavka!A:I,135,7)","v":0},{"$f":"INDEX(Objednavka!A:I,135,8)","v":0},null,{"$f":"IF(INDEX(Objednavka!A:J,135,10)=\"\",\"\",INDEX(Objednavka!A:J,135,10))","v":""}]
[null,{"$f":"IF(INDEX(Objednavka!A:I,136,3)=\"\",INDEX(Objednavka!A:I,136,1),INDEX(Objednavka!A:I,136,3))","v":"Kostarika - Palmichal El Cedral Black Honey - 60 Kg - min. odběr 10 pytlů"},null,null,null,null,null,{"$f":"INDEX(Objednavka!A:I,136,4)","v":17100},null,{"$f":"INDEX(Objednavka!A:I,136,5)","v":19665},{"$f":"INDEX(Objednavka!A:I,136,7)","v":0},{"$f":"INDEX(Objednavka!A:I,136,8)","v":0},null,{"$f":"IF(INDEX(Objednavka!A:J,136,10)=\"\",\"\",INDEX(Objednavka!A:J,136,10))","v":""}]
[null,{"$f":"IF(INDEX(Objednavka!A:I,137,3)=\"\",INDEX(Objednavka!A:I,137,1),INDEX(Objednavka!A:I,137,3))","v":"Kuba - Serrano Lavado - 1 Kg"},null,null,null,null,null,{"$f":"INDEX(Objednavka!A:I,137,4)","v":369},null,{"$f":"INDEX(Objednavka!A:I,137,5)","v":424.34999999999997},{"$f":"INDEX(Objednavka!A:I,137,7)","v":0},{"$f":"INDEX(Objednavka!A:I,137,8)","v":0},null,{"$f":"IF(INDEX(Objednavka!A:J,137,10)=\"\",\"\",INDEX(Objednavka!A:J,137,10))","v":""}]
[null,{"$f":"IF(INDEX(Objednavka!A:I,138,3)=\"\",INDEX(Objednavka!A:I,138,1),INDEX(Objednavka!A:I,138,3))","v":"Kuba - Serrano Lavado - 5 Kg"},null,null,null,null,null,{"$f":"INDEX(Objednavka!A:I,138,4)","v":1587},null,{"$f":"INDEX(Objednavka!A:I,138,5)","v":1825.05},{"$f":"INDEX(Objednavka!A:I,138,7)","v":0},{"$f":"INDEX(Objednavka!A:I,138,8)","v":0},null,{"$f":"IF(INDEX(Objednavka!A:J,138,10)=\"\",\"\",INDEX(Objednavka!A:J,138,10))","v":""}]
[null,{"$f":"IF(INDEX(Objednavka!A:I,139,3)=\"\",INDEX(Objednavka!A:I,139,1),INDEX(Objednavka!A:I,139,3))","v":"Kuba - Serrano Lavado - 10 Kg"},null,null,null,null,null,{"$f":"INDEX(Objednavka!A:I,139,4)","v":2783},null,{"$f":"INDEX(Objednavka!A:I,139,5)","v":3200.45},{"$f":"INDEX(Objednavka!A:I,139,7)","v":0},{"$f":"INDEX(Objednavka!A:I,139,8)","v":0},null,{"$f":"IF(INDEX(Objednavka!A:J,139,10)=\"\",\"\",INDEX(Objednavka!A:J,139,10))","v":""}]
[null,{"$f":"IF(INDEX(Objednavka!A:I,140,3)=\"\",INDEX(Objednavka!A:I,140,1),INDEX(Objednavka!A:I,140,3))","v":"Kuba - Serrano Lavado - 20 Kg"},null,null,null,null,null,{"$f":"INDEX(Objednavka!A:I,140,4)","v":4957},null,{"$f":"INDEX(Objednavka!A:I,140,5)","v":5700.5499999999993},{"$f":"INDEX(Objednavka!A:I,140,7)","v":0},{"$f":"INDEX(Objednavka!A:I,140,8)","v":0},null,{"$f":"IF(INDEX(Objednavka!A:J,140,10)=\"\",\"\",INDEX(Objednavka!A:J,140,10))","v":""}]
[null,{"$f":"IF(INDEX(Objednavka!A:I,141,3)=\"\",INDEX(Objednavka!A:I,141,1),INDEX(Objednavka!A:I,141,3))","v":"Kuba - Serrano Lavado - 40 Kg"},null,null,null,null,null,{"$f":"INDEX(Objednavka!A:I,141,4)","v":8939},null,{"$f":"INDEX(Objednavka!A:I,141,5)","v":10279.849999999999},{"$f":"INDEX(Objednavka!A:I,141,7)","v":0},{"$f":"INDEX(Objednavka!A:I,141,8)","v":0},null,{"$f":"IF(INDEX(Objednavka!A:J,141,10)=\"\",\"\",INDEX(Objednavka!A:J,141,10))","v":""}]
[null,{"$f":"IF(INDEX(Objednavka!A:I,142,3)=\"\",INDEX(Objednavka!A:I,142,1),INDEX(Objednavka!A:I,142,3))","v":"Kuba - Serrano Lavado - 60 Kg"},null,null,null,null,null,{"$f":"INDEX(Objednavka!A:I,142,4)","v":12209},null,{"$f":"INDEX(Objednavka!A:I,142,5)","v":14040.349999999999},{"$f":"INDEX(Objednavka!A:I,142,7)","v":0},{"$f":"INDEX(Objednavka!A:I,142,8)","v":0},null,{"$f":"IF(INDEX(Objednavka!A:J,142,10)=\"\",\"\",INDEX(Objednavka!A:J,142,10))","v":""}]
[null,{"$f":"IF(INDEX(Objednavka!A:I,143,3)=\"\",INDEX(Objednavka!A:I,143,1),INDEX(Objednavka!A:I,143,3))","v":"Kuba - Serrano Lavado - 60 Kg - min. odběr 10 pytlů"},null,null,null,null,null,{"$f":"INDEX(Objednavka!A:I,143,4)","v":11374},null,{"$f":"INDEX(Objednavka!A:I,143,5)","v":13080.099999999999},{"$f":"INDEX(Objednavka!A:I,143,7)","v":0},{"$f":"INDEX(Objednavka!A:I,143,8)","v":0},null,{"$f":"IF(INDEX(Objednavka!A:J,143,10)=\"\",\"\",INDEX(Objednavka!A:J,143,10))","v":""}]
[null,{"$f":"IF(INDEX(Objednavka!A:I,144,3)=\"\",INDEX(Objednavka!A:I,144,1),INDEX(Objednavka!A:I,144,3))","v":"Malawi - Rain Forest Alliance - 1 Kg"},null,null,null,null,null,{"$f":"INDEX(Objednavka!A:I,144,4)","v":328},null,{"$f":"INDEX(Objednavka!A:I,144,5)","v":377.2},{"$f":"INDEX(Objednavka!A:I,144,7)","v":0},{"$f":"INDEX(Objednavka!A:I,144,8)","v":0},null,{"$f":"IF(INDEX(Objednavka!A:J,144,10)=\"\",\"\",INDEX(Objednavka!A:J,144,10))","v":""}]
[null,{"$f":"IF(INDEX(Objednavka!A:I,145,3)=\"\",INDEX(Objednavka!A:I,145,1),INDEX(Objednavka!A:I,145,3))","v":"Malawi - Rain Forest Alliance - 5 Kg"},null,null,null,null,null,{"$f":"INDEX(Objednavka!A:I,145,4)","v":1413},null,{"$f":"INDEX(Objednavka!A:I,145,5)","v":1624.9499999999998},{"$f":"INDEX(Objednavka!A:I,145,7)","v":0},{"$f":"INDEX(Objednavka!A:I,145,8)","v":0},null,{"$f":"IF(INDEX(Objednavka!A:J,145,10)=\"\",\"\",INDEX(Objednavka!A:J,145,10))","v":""}]
[null,{"$f":"IF(INDEX(Objednavka!A:I,146,3)=\"\",INDEX(Objednavka!A:I,146,1),INDEX(Objednavka!A:I,146,3))","v":"Malawi - Rain Forest Alliance - 10 Kg"},null,null,null,null,null,{"$f":"INDEX(Objednavka!A:I,146,4)","v":2478},null,{"$f":"INDEX(Objednavka!A:I,146,5)","v":2849.7},{"$f":"INDEX(Objednavka!A:I,146,7)","v":0},{"$f":"INDEX(Objednavka!A:I,146,8)","v":0},null,{"$f":"IF(INDEX(Objednavka!A:J,146,10)=\"\",\"\",INDEX(Objednavka!A:J,146,10))","v":""}]
[null,{"$f":"IF(INDEX(Objednavka!A:I,147,3)=\"\",INDEX(Objednavka!A:I,147,1),INDEX(Objednavka!A:I,147,3))","v":"Malawi - Rain Forest Alliance - 20 Kg"},null,null,null,null,null,{"$f":"INDEX(Objednavka!A:I,147,4)","v":4416},null,{"$f":"INDEX(Objednavka!A:I,147,5)","v":5078.3999999999996},{"$f":"INDEX(Objednavka!A:I,147,7)","v":0},{"$f":"INDEX(Objednavka!A:I,147,8)","v":0},null,{"$f":"IF(INDEX(Objednavka!A:J,147,10)=\"\",\"\",INDEX(Objednavka!A:J,147,10))","v":""}]
[null,{"$f":"IF(INDEX(Objednavka!A:I,148,3)=\"\",INDEX(Objednavka!A:I,148,1),INDEX(Objednavka!A:I,148,3))","v":"Malawi - Rain Forest Alliance - 40 Kg"},null,null,null,null,null,{"$f":"INDEX(Objednavka!A:I,148,4)","v":7965},null,{"$f":"INDEX(Objednavka!A:I,148,5)","v":9159.75},{"$f":"INDEX(Objednavka!A:I,148,7)","v":0},{"$f":"INDEX(Objednavka!A:I,148,8)","v":0},null,{"$f":"IF(INDEX(Objednavka!A:J,148,10)=\"\",\"\",INDEX(Objednavka!A:J,148,10))","v":""}]
[null,{"$f":"IF(INDEX(Objednavka!A:I,149,3)=\"\",INDEX(Objednavka!A:I,149,1),INDEX(Objednavka!A:I,149,3))","v":"Malawi - Rain Forest Alliance - 60 Kg"},null,null,null,null,null,{"$f":"INDEX(Objednavka!A:I,149,4)","v":10852},null,{"$f":"INDEX(Objednavka!A:I,149,5)","v":12479.8},{"$f":"INDEX(Objednavka!A:I,149,7)","v":0},{"$f":"INDEX(Objednavka!A:I,149,8)","v":0},null,{"$f":"IF(INDEX(Objednavka!A:J,149,10)=\"\",\"\",INDEX(Objednavka!A:J,149,10))","v":""}]
[null,{"$f":"IF(INDEX(Objednavka!A:I,150,3)=\"\",INDEX(Objednavka!A:I,150,1),INDEX(Objednavka!A:I,150,3))","v":"Malawi - Rain Forest Alliance - 60 Kg - min. odběr 10 pytlů"},null,null,null,null,null,{"$f":"INDEX(Objednavka!A:I,150,4)","v":10122},null,{"$f":"INDEX(Objednavka!A:I,150,5)","v":11640.3},{"$f":"INDEX(Objednavka!A:I,150,7)","v":0},{"$f":"INDEX(Objednavka!A:I,150,8)","v":0},null,{"$f":"IF(INDEX(Objednavka!A:J,150,10)=\"\",\"\",INDEX(Objednavka!A:J,150,10))","v":""}]
[null,{"$f":"IF(INDEX(Objednavka!A:I,151,3)=\"\",INDEX(Objednavka!A:I,151,1),INDEX(Objednavka!A:I,151,3))","v":"Mexico - SHG EP El Conejo - 1 Kg"},null,null,null,null,null,{"$f":"INDEX(Objednavka!A:I,151,4)","v":322},null,{"$f":"INDEX(Objednavka!A:I,151,5)","v":370.29999999999995},{"$f":"INDEX(Objednavka!A:I,151,7)","v":0},{"$f":"INDEX(Objednavka!A:I,151,8)","v":0},null,{"$f":"IF(INDEX(Objednavka!A:J,151,10)=\"\",\"\",INDEX(Objednavka!A:J,151,10))","v":""}]
[null,{"$f":"IF(INDEX(Objednavka!A:I,152,3)=\"\",INDEX(Objednavka!A:I,152,1),INDEX(Objednavka!A:I,152,3))","v":"Mexico - SHG EP El Conejo - 5 Kg"},null,null,null,null,null,{"$f":"INDEX(Objednavka!A:I,152,4)","v":1383},null,{"$f":"INDEX(Objednavka!A:I,152,5)","v":1590.4499999999998},{"$f":"INDEX(Objednavka!A:I,152,7)","v":0},{"$f":"INDEX(Objednavka!A:I,152,8)","v":0},null,{"$f":"IF(INDEX(Objednavka!A:J,152,10)=\"\",\"\",INDEX(Objednavka!A:J,152,10))","v":""}]
[null,{"$f":"IF(INDEX(Objednavka!A:I,153,3)=\"\",INDEX(Objednavka!A:I,153,1),INDEX(Objednavka!A:I,153,3))","v":"Mexico - SHG EP El Conejo - 10 Kg"},null,null,null,null,null,{"$f":"INDEX(Objednavka!A:I,153,4)","v":2426},null,{"$f":"INDEX(Objednavka!A:I,153,5)","v":2789.8999999999996},{"$f":"INDEX(Objednavka!A:I,153,7)","v":0},{"$f":"INDEX(Objednavka!A:I,153,8)","v":0},null,{"$f":"IF(INDEX(Objednavka!A:J,153,10)=\"\",\"\",INDEX(Objednavka!A:J,153,10))","v":""}]
[null,{"$f":"IF(INDEX(Objednavka!A:I,154,3)=\"\",INDEX(Objednavka!A:I,154,1),INDEX(Objednavka!A:I,154,3))","v":"Mexico - SHG EP El Conejo - 20 Kg"},null,null,null,null,null,{"$f":"INDEX(Objednavka!A:I,154,4)","v":4330},null,{"$f":"INDEX(Objednavka!A:I,154,5)","v":4979.5},{"$f":"INDEX(Objednavka!A:I,154,7)","v":0},{"$f":"INDEX(Objednavka!A:I,154,8)","v":0},null,{"$f":"IF(INDEX(Objednavka!A:J,154,10)=\"\",\"\",INDEX(Objednavka!A:J,154,10))","v":""}]
[null,{"$f":"IF(INDEX(Objednavka!A:I,155,3)=\"\",INDEX(Objednavka!A:I,155,1),INDEX(Objednavka!A:I,155,3))","v":"Mexico - SHG EP El Conejo - 40 Kg"},null,null,null,null,null,{"$f":"INDEX(Objednavka!A:I,155,4)","v":7791},null,{"$f":"INDEX(Objednavka!A:I,155,5)","v":8959.65},{"$f":"INDEX(Objednavka!A:I,155,7)","v":0},{"$f":"INDEX(Objednavka!A:I,155,8)","v":0},null,{"$f":"IF(INDEX(Objednavka!A:J,155,10)=\"\",\"\",INDEX(Objednavka!A:J,155,10))","v":""}]
[null,{"$f":"IF(INDEX(Objednavka!A:I,156,3)=\"\",INDEX(Objednavka!A:I,156,1),INDEX(Objednavka!A:I,156,3))","v":"Mexico - SHG EP El Conejo - 69 Kg"},null,null,null,null,null,{"$f":"INDEX(Objednavka!A:I,156,4)","v":12240},null,{"$f":"INDEX(Objednavka!A:I,156,5)","v":14075.999999999998},{"$f":"INDEX(Objednavka!A:I,156,7)","v":0},{"$f":"INDEX(Objednavka!A:I,156,8)","v":0},null,{"$f":"IF(INDEX(Objednavka!A:J,156,10)=\"\",\"\",INDEX(Objednavka!A:J,156,10))","v":""}]
[null,{"$f":"IF(INDEX(Objednavka!A:I,157,3)=\"\",INDEX(Objednavka!A:I,157,1),INDEX(Objednavka!A:I,157,3))","v":"Mexico - SHG EP El Conejo - 69 Kg - min. odběr 10 pytlů"},null,null,null,null,null,{"$f":"INDEX(Objednavka!A:I,157,4)","v":11400},null,{"$f":"INDEX(Objednavka!A:I,157,5)","v":13109.999999999998},{"$f":"INDEX(Objednavka!A:I,157,7)","v":0},{"$f":"INDEX(Objednavka!A:I,157,8)","v":0},null,{"$f":"IF(INDEX(Objednavka!A:J,157,10)=\"\",\"\",INDEX(Objednavka!A:J,157,10))","v":""}]
[null,{"$f":"IF(INDEX(Objednavka!A:I,158,3)=\"\",INDEX(Objednavka!A:I,158,1),INDEX(Objednavka!A:I,158,3))","v":"Mexico bez kofeinu - El Tucan Mountain Water Process - 1 Kg"},null,null,null,null,null,{"$f":"INDEX(Objednavka!A:I,158,4)","v":353},null,{"$f":"INDEX(Objednavka!A:I,158,5)","v":405.95},{"$f":"INDEX(Objednavka!A:I,158,7)","v":0},{"$f":"INDEX(Objednavka!A:I,158,8)","v":0},null,{"$f":"IF(INDEX(Objednavka!A:J,158,10)=\"\",\"\",INDEX(Objednavka!A:J,158,10))","v":""}]
[null,{"$f":"IF(INDEX(Objednavka!A:I,159,3)=\"\",INDEX(Objednavka!A:I,159,1),INDEX(Objednavka!A:I,159,3))","v":"Mexico bez kofeinu - El Tucan Mountain Water Process - 5 Kg"},null,null,null,null,null,{"$f":"INDEX(Objednavka!A:I,159,4)","v":1522},null,{"$f":"INDEX(Objednavka!A:I,159,5)","v":1750.3},{"$f":"INDEX(Objednavka!A:I,159,7)","v":0},{"$f":"INDEX(Objednavka!A:I,159,8)","v":0},null,{"$f":"IF(INDEX(Objednavka!A:J,159,10)=\"\",\"\",INDEX(Objednavka!A:J,159,10))","v":""}]
[null,{"$f":"IF(INDEX(Objednavka!A:I,160,3)=\"\",INDEX(Objednavka!A:I,160,1),INDEX(Objednavka!A:I,160,3))","v":"Mexico bez kofeinu - El Tucan Mountain Water Process - 10 Kg"},null,null,null,null,null,{"$f":"INDEX(Objednavka!A:I,160,4)","v":2670},null,{"$f":"INDEX(Objednavka!A:I,160,5)","v":3070.4999999999995},{"$f":"INDEX(Objednavka!A:I,160,7)","v":0},{"$f":"INDEX(Objednavka!A:I,160,8)","v":0},null,{"$f":"IF(INDEX(Objednavka!A:J,160,10)=\"\",\"\",INDEX(Objednavka!A:J,160,10))","v":""}]
[null,{"$f":"IF(INDEX(Objednavka!A:I,161,3)=\"\",INDEX(Objednavka!A:I,161,1),INDEX(Objednavka!A:I,161,3))","v":"Mexico bez kofeinu - El Tucan Mountain Water Process - 20 Kg"},null,null,null,null,null,{"$f":"INDEX(Objednavka!A:I,161,4)","v":4748},null,{"$f":"INDEX(Objednavka!A:I,161,5)","v":5460.2},{"$f":"INDEX(Objednavka!A:I,161,7)","v":0},{"$f":"INDEX(Objednavka!A:I,161,8)","v":0},null,{"$f":"IF(INDEX(Objednavka!A:J,161,10)=\"\",\"\",INDEX(Objednavka!A:J,161,10))","v":""}]
[null,{"$f":"IF(INDEX(Objednavka!A:I,162,3)=\"\",INDEX(Objednavka!A:I,162,1),INDEX(Objednavka!A:I,162,3))","v":"Mexico bez kofeinu - El Tucan Mountain Water Process - 40 Kg"},null,null,null,null,null,{"$f":"INDEX(Objednavka!A:I,162,4)","v":8591},null,{"$f":"INDEX(Objednavka!A:I,162,5)","v":9879.65},{"$f":"INDEX(Objednavka!A:I,162,7)","v":0},{"$f":"INDEX(Objednavka!A:I,162,8)","v":0},null,{"$f":"IF(INDEX(Objednavka!A:J,162,10)=\"\",\"\",INDEX(Objednavka!A:J,162,10))","v":""}]
[null,{"$f":"IF(INDEX(Objednavka!A:I,163,3)=\"\",INDEX(Objednavka!A:I,163,1),INDEX(Objednavka!A:I,163,3))","v":"Mexico bez kofeinu - El Tucan Mountain Water Process - 69 Kg"},null,null,null,null,null,{"$f":"INDEX(Objednavka!A:I,163,4)","v":13500},null,{"$f":"INDEX(Objednavka!A:I,163,5)","v":15524.999999999998},{"$f":"INDEX(Objednavka!A:I,163,7)","v":0},{"$f":"INDEX(Objednavka!A:I,163,8)","v":0},null,{"$f":"IF(INDEX(Objednavka!A:J,163,10)=\"\",\"\",INDEX(Objednavka!A:J,163,10))","v":""}]
[null,{"$f":"IF(INDEX(Objednavka!A:I,164,3)=\"\",INDEX(Objednavka!A:I,164,1),INDEX(Objednavka!A:I,164,3))","v":"Mexico bez kofeinu - El Tucan Mountain Water Process - 69 Kg - min. odběr 10 pytlů"},null,null,null,null,null,{"$f":"INDEX(Objednavka!A:I,164,4)","v":12540},null,{"$f":"INDEX(Objednavka!A:I,164,5)","v":14420.999999999998},{"$f":"INDEX(Objednavka!A:I,164,7)","v":0},{"$f":"INDEX(Objednavka!A:I,164,8)","v":0},null,{"$f":"IF(INDEX(Objednavka!A:J,164,10)=\"\",\"\",INDEX(Objednavka!A:J,164,10))","v":""}]
[null,{"$f":"IF(INDEX(Objednavka!A:I,165,3)=\"\",INDEX(Objednavka!A:I,165,1),INDEX(Objednavka!A:I,165,3))","v":"Panama Boquete SHP EP San Sebastian Estate - 1 Kg"},null,null,null,null,null,{"$f":"INDEX(Objednavka!A:I,165,4)","v":448},null,{"$f":"INDEX(Objednavka!A:I,165,5)","v":515.19999999999993},{"$f":"INDEX(Objednavka!A:I,165,7)","v":0},{"$f":"INDEX(Objednavka!A:I,165,8)","v":0},null,{"$f":"IF(INDEX(Objednavka!A:J,165,10)=\"\",\"\",INDEX(Objednavka!A:J,165,10))","v":""}]
[null,{"$f":"IF(INDEX(Objednavka!A:I,166,3)=\"\",INDEX(Objednavka!A:I,166,1),INDEX(Objednavka!A:I,166,3))","v":"Panama Boquete SHP EP San Sebastian Estate - 5 Kg"},null,null,null,null,null,{"$f":"INDEX(Objednavka!A:I,166,4)","v":1926},null,{"$f":"INDEX(Objednavka!A:I,166,5)","v":2214.8999999999996},{"$f":"INDEX(Objednavka!A:I,166,7)","v":0},{"$f":"INDEX(Objednavka!A:I,166,8)","v":0},null,{"$f":"IF(INDEX(Objednavka!A:J,166,10)=\"\",\"\",INDEX(Objednavka!A:J,166,10))","v":""}]
[null,{"$f":"IF(INDEX(Objednavka!A:I,167,3)=\"\",INDEX(Objednavka!A:I,167,1),INDEX(Objednavka!A:I,167,3))","v":"Panama Boquete SHP EP San Sebastian Estate - 10 Kg"},null,null,null,null,null,{"$f":"INDEX(Objednavka!A:I,167,4)","v":3383},null,{"$f":"INDEX(Objednavka!A:I,167,5)","v":3890.45},{"$f":"INDEX(Objednavka!A:I,167,7)","v":0},{"$f":"INDEX(Objednavka!A:I,167,8)","v":0},null,{"$f":"IF(INDEX(Objednavka!A:J,167,10)=\"\",\"\",INDEX(Objednavka!A:J,167,10))","v":""}]
[null,{"$f":"IF(INDEX(Objednavka!A:I,168,3)=\"\",INDEX(Objednavka!A:I,168,1),INDEX(Objednavka!A:I,168,3))","v":"Panama Boquete SHP EP San Sebastian Estate - 20 Kg"},null,null,null,null,null,{"$f":"INDEX(Objednavka!A:I,168,4)","v":6017},null,{"$f":"INDEX(Objednavka!A:I,168,5)","v":6919.5499999999993},{"$f":"INDEX(Objednavka!A:I,168,7)","v":0},{"$f":"INDEX(Objednavka!A:I,168,8)","v":0},null,{"$f":"IF(INDEX(Objednavka!A:J,168,10)=\"\",\"\",INDEX(Objednavka!A:J,168,10))","v":""}]
[null,{"$f":"IF(INDEX(Objednavka!A:I,169,3)=\"\",INDEX(Objednavka!A:I,169,1),INDEX(Objednavka!A:I,169,3))","v":"Panama Boquete SHP EP San Sebastian Estate - 40 Kg"},null,null,null,null,null,{"$f":"INDEX(Objednavka!A:I,169,4)","v":10852},null,{"$f":"INDEX(Objednavka!A:I,169,5)","v":12479.8},{"$f":"INDEX(Objednavka!A:I,169,7)","v":0},{"$f":"INDEX(Objednavka!A:I,169,8)","v":0},null,{"$f":"IF(INDEX(Objednavka!A:J,169,10)=\"\",\"\",INDEX(Objednavka!A:J,169,10))","v":""}]
[null,{"$f":"IF(INDEX(Objednavka!A:I,170,3)=\"\",INDEX(Objednavka!A:I,170,1),INDEX(Objednavka!A:I,170,3))","v":"Panama Boquete SHP EP San Sebastian Estate - 60 Kg"},null,null,null,null,null,{"$f":"INDEX(Objednavka!A:I,170,4)","v":14818},null,{"$f":"INDEX(Objednavka!A:I,170,5)","v":17040.699999999997},{"$f":"INDEX(Objednavka!A:I,170,7)","v":0},{"$f":"INDEX(Objednavka!A:I,170,8)","v":0},null,{"$f":"IF(INDEX(Objednavka!A:J,170,10)=\"\",\"\",INDEX(Objednavka!A:J,170,10))","v":""}]
[null,{"$f":"IF(INDEX(Objednavka!A:I,171,3)=\"\",INDEX(Objednavka!A:I,171,1),INDEX(Objednavka!A:I,171,3))","v":"Panama Boquete SHP EP San Sebastian Estate - 60 Kg - min. odběr 10 pytlů"},null,null,null,null,null,{"$f":"INDEX(Objednavka!A:I,171,4)","v":13826},null,{"$f":"INDEX(Objednavka!A:I,171,5)","v":15899.9},{"$f":"INDEX(Objednavka!A:I,171,7)","v":0},{"$f":"INDEX(Objednavka!A:I,171,8)","v":0},null,{"$f":"IF(INDEX(Objednavka!A:J,171,10)=\"\",\"\",INDEX(Objednavka!A:J,171,10))","v":""}]
[null,{"$f":"IF(INDEX(Objednavka!A:I,172,3)=\"\",INDEX(Objednavka!A:I,172,1),INDEX(Objednavka!A:I,172,3))","v":"Papua - Nová Guinea - Goroka Plantation A/X - 1 Kg"},null,null,null,null,null,{"$f":"INDEX(Objednavka!A:I,172,4)","v":314},null,{"$f":"INDEX(Objednavka!A:I,172,5)","v":361.09999999999997},{"$f":"INDEX(Objednavka!A:I,172,7)","v":0},{"$f":"INDEX(Objednavka!A:I,172,8)","v":0},null,{"$f":"IF(INDEX(Objednavka!A:J,172,10)=\"\",\"\",INDEX(Objednavka!A:J,172,10))","v":""}]
[null,{"$f":"IF(INDEX(Objednavka!A:I,173,3)=\"\",INDEX(Objednavka!A:I,173,1),INDEX(Objednavka!A:I,173,3))","v":"Papua - Nová Guinea - Goroka Plantation A/X - 5 Kg"},null,null,null,null,null,{"$f":"INDEX(Objednavka!A:I,173,4)","v":1352},null,{"$f":"INDEX(Objednavka!A:I,173,5)","v":1554.8},{"$f":"INDEX(Objednavka!A:I,173,7)","v":0},{"$f":"INDEX(Objednavka!A:I,173,8)","v":0},null,{"$f":"IF(INDEX(Objednavka!A:J,173,10)=\"\",\"\",INDEX(Objednavka!A:J,173,10))","v":""}]
[null,{"$f":"IF(INDEX(Objednavka!A:I,174,3)=\"\",INDEX(Objednavka!A:I,174,1),INDEX(Objednavka!A:I,174,3))","v":"Papua - Nová Guinea - Goroka Plantation A/X - 10 Kg"},null,null,null,null,null,{"$f":"INDEX(Objednavka!A:I,174,4)","v":2374},null,{"$f":"INDEX(Objednavka!A:I,174,5)","v":2730.1},{"$f":"INDEX(Objednavka!A:I,174,7)","v":0},{"$f":"INDEX(Objednavka!A:I,174,8)","v":0},null,{"$f":"IF(INDEX(Objednavka!A:J,174,10)=\"\",\"\",INDEX(Objednavka!A:J,174,10))","v":""}]
[null,{"$f":"IF(INDEX(Objednavka!A:I,175,3)=\"\",INDEX(Objednavka!A:I,175,1),INDEX(Objednavka!A:I,175,3))","v":"Papua - Nová Guinea - Goroka Plantation A/X - 20 Kg"},null,null,null,null,null,{"$f":"INDEX(Objednavka!A:I,175,4)","v":4226},null,{"$f":"INDEX(Objednavka!A:I,175,5)","v":4859.8999999999996},{"$f":"INDEX(Objednavka!A:I,175,7)","v":0},{"$f":"INDEX(Objednavka!A:I,175,8)","v":0},null,{"$f":"IF(INDEX(Objednavka!A:J,175,10)=\"\",\"\",INDEX(Objednavka!A:J,175,10))","v":""}]
[null,{"$f":"IF(INDEX(Objednavka!A:I,176,3)=\"\",INDEX(Objednavka!A:I,176,1),INDEX(Objednavka!A:I,176,3))","v":"Papua - Nová Guinea - Goroka Plantation A/X - 40 Kg"},null,null,null,null,null,{"$f":"INDEX(Objednavka!A:I,176,4)","v":7617},null,{"$f":"INDEX(Objednavka!A:I,176,5)","v":8759.5499999999993},{"$f":"INDEX(Objednavka!A:I,176,7)","v":0},{"$f":"INDEX(Objednavka!A:I,176,8)","v":0},null,{"$f":"IF(INDEX(Objednavka!A:J,176,10)=\"\",\"\",INDEX(Objednavka!A:J,176,10))","v":""}]
[null,{"$f":"IF(INDEX(Objednavka!A:I,177,3)=\"\",INDEX(Objednavka!A:I,177,1),INDEX(Objednavka!A:I,177,3))","v":"Papua - Nová Guinea - Goroka Plantation A/X - 60 Kg"},null,null,null,null,null,{"$f":"INDEX(Objednavka!A:I,177,4)","v":10435},null,{"$f":"INDEX(Objednavka!A:I,177,5)","v":12000.249999999998},{"$f":"INDEX(Objednavka!A:I,177,7)","v":0},{"$f":"INDEX(Objednavka!A:I,177,8)","v":0},null,{"$f":"IF(INDEX(Objednavka!A:J,177,10)=\"\",\"\",INDEX(Objednavka!A:J,177,10))","v":""}]
[null,{"$f":"IF(INDEX(Objednavka!A:I,178,3)=\"\",INDEX(Objednavka!A:I,178,1),INDEX(Objednavka!A:I,178,3))","v":"Papua - Nová Guinea - Goroka Plantation A/X - 60 Kg - min. odběr 10 pytlů"},null,null,null,null,null,{"$f":"INDEX(Objednavka!A:I,178,4)","v":9704},null,{"$f":"INDEX(Objednavka!A:I,178,5)","v":11159.599999999999},{"$f":"INDEX(Objednavka!A:I,178,7)","v":0},{"$f":"INDEX(Objednavka!A:I,178,8)","v":0},null,{"$f":"IF(INDEX(Objednavka!A:J,178,10)=\"\",\"\",INDEX(Objednavka!A:J,178,10))","v":""}]
[null,{"$f":"IF(INDEX(Objednavka!A:I,179,3)=\"\",INDEX(Objednavka!A:I,179,1),INDEX(Objednavka!A:I,179,3))","v":"Peru -  Grade 1 - 1 Kg"},null,null,null,null,null,{"$f":"INDEX(Objednavka!A:I,179,4)","v":226},null,{"$f":"INDEX(Objednavka!A:I,179,5)","v":259.89999999999998},{"$f":"INDEX(Objednavka!A:I,179,7)","v":0},{"$f":"INDEX(Objednavka!A:I,179,8)","v":0},null,{"$f":"IF(INDEX(Objednavka!A:J,179,10)=\"\",\"\",INDEX(Objednavka!A:J,179,10))","v":""}]
[null,{"$f":"IF(INDEX(Objednavka!A:I,180,3)=\"\",INDEX(Objednavka!A:I,180,1),INDEX(Objednavka!A:I,180,3))","v":"Peru -  Grade 1 - 5 Kg"},null,null,null,null,null,{"$f":"INDEX(Objednavka!A:I,180,4)","v":974},null,{"$f":"INDEX(Objednavka!A:I,180,5)","v":1120.0999999999999},{"$f":"INDEX(Objednavka!A:I,180,7)","v":0},{"$f":"INDEX(Objednavka!A:I,180,8)","v":0},null,{"$f":"IF(INDEX(Objednavka!A:J,180,10)=\"\",\"\",INDEX(Objednavka!A:J,180,10))","v":""}]
[null,{"$f":"IF(INDEX(Objednavka!A:I,181,3)=\"\",INDEX(Objednavka!A:I,181,1),INDEX(Objednavka!A:I,181,3))","v":"Peru -  Grade 1 - 10 Kg"},null,null,null,null,null,{"$f":"INDEX(Objednavka!A:I,181,4)","v":1713},null,{"$f":"INDEX(Objednavka!A:I,181,5)","v":1969.9499999999998},{"$f":"INDEX(Objednavka!A:I,181,7)","v":0},{"$f":"INDEX(Objednavka!A:I,181,8)","v":0},null,{"$f":"IF(INDEX(Objednavka!A:J,181,10)=\"\",\"\",INDEX(Objednavka!A:J,181,10))","v":""}]
[null,{"$f":"IF(INDEX(Objednavka!A:I,182,3)=\"\",INDEX(Objednavka!A:I,182,1),INDEX(Objednavka!A:I,182,3))","v":"Peru -  Grade 1 - 20 Kg"},null,null,null,null,null,{"$f":"INDEX(Objednavka!A:I,182,4)","v":3043},null,{"$f":"INDEX(Objednavka!A:I,182,5)","v":3499.45},{"$f":"INDEX(Objednavka!A:I,182,7)","v":0},{"$f":"INDEX(Objednavka!A:I,182,8)","v":0},null,{"$f":"IF(INDEX(Objednavka!A:J,182,10)=\"\",\"\",INDEX(Objednavka!A:J,182,10))","v":""}]
[null,{"$f":"IF(INDEX(Objednavka!A:I,183,3)=\"\",INDEX(Objednavka!A:I,183,1),INDEX(Objednavka!A:I,183,3))","v":"Peru -  Grade 1 - 40 Kg"},null,null,null,null,null,{"$f":"INDEX(Objednavka!A:I,183,4)","v":5496},null,{"$f":"INDEX(Objednavka!A:I,183,5)","v":6320.4},{"$f":"INDEX(Objednavka!A:I,183,7)","v":0},{"$f":"INDEX(Objednavka!A:I,183,8)","v":0},null,{"$f":"IF(INDEX(Objednavka!A:J,183,10)=\"\",\"\",INDEX(Objednavka!A:J,183,10))","v":""}]
[null,{"$f":"IF(INDEX(Objednavka!A:I,184,3)=\"\",INDEX(Objednavka!A:I,184,1),INDEX(Objednavka!A:I,184,3))","v":"Peru -  Grade 1 - 69 Kg"},null,null,null,null,null,{"$f":"INDEX(Objednavka!A:I,184,4)","v":8640},null,{"$f":"INDEX(Objednavka!A:I,184,5)","v":9936},{"$f":"INDEX(Objednavka!A:I,184,7)","v":0},{"$f":"INDEX(Objednavka!A:I,184,8)","v":0},null,{"$f":"IF(INDEX(Objednavka!A:J,184,10)=\"\",\"\",INDEX(Objednavka!A:J,184,10))","v":""}]
[null,{"$f":"IF(INDEX(Objednavka!A:I,185,3)=\"\",INDEX(Objednavka!A:I,185,1),INDEX(Objednavka!A:I,185,3))","v":"Peru -  Grade 1 - 69 Kg - min. odběr 10 pytlů"},null,null,null,null,null,{"$f":"INDEX(Objednavka!A:I,185,4)","v":8040},null,{"$f":"INDEX(Objednavka!A:I,185,5)","v":9246},{"$f":"INDEX(Objednavka!A:I,185,7)","v":0},{"$f":"INDEX(Objednavka!A:I,185,8)","v":0},null,{"$f":"IF(INDEX(Objednavka!A:J,185,10)=\"\",\"\",INDEX(Objednavka!A:J,185,10))","v":""}]
[null,{"$f":"IF(INDEX(Objednavka!A:I,186,3)=\"\",INDEX(Objednavka!A:I,186,1),INDEX(Objednavka!A:I,186,3))","v":"Rwanda AA - 1 Kg"},null,null,null,null,null,{"$f":"INDEX(Objednavka!A:I,186,4)","v":285},null,{"$f":"INDEX(Objednavka!A:I,186,5)","v":327.75},{"$f":"INDEX(Objednavka!A:I,186,7)","v":0},{"$f":"INDEX(Objednavka!A:I,186,8)","v":0},null,{"$f":"IF(INDEX(Objednavka!A:J,186,10)=\"\",\"\",INDEX(Objednavka!A:J,186,10))","v":""}]
[null,{"$f":"IF(INDEX(Objednavka!A:I,187,3)=\"\",INDEX(Objednavka!A:I,187,1),INDEX(Objednavka!A:I,187,3))","v":"Rwanda AA - 5 Kg"},null,null,null,null,null,{"$f":"INDEX(Objednavka!A:I,187,4)","v":1226},null,{"$f":"INDEX(Objednavka!A:I,187,5)","v":1409.8999999999999},{"$f":"INDEX(Objednavka!A:I,187,7)","v":0},{"$f":"INDEX(Objednavka!A:I,187,8)","v":0},null,{"$f":"IF(INDEX(Objednavka!A:J,187,10)=\"\",\"\",INDEX(Objednavka!A:J,187,10))","v":""}]
[null,{"$f":"IF(INDEX(Objednavka!A:I,188,3)=\"\",INDEX(Objednavka!A:I,188,1),INDEX(Objednavka!A:I,188,3))","v":"Rwanda AA - 10 Kg"},null,null,null,null,null,{"$f":"INDEX(Objednavka!A:I,188,4)","v":2157},null,{"$f":"INDEX(Objednavka!A:I,188,5)","v":2480.5499999999997},{"$f":"INDEX(Objednavka!A:I,188,7)","v":0},{"$f":"INDEX(Objednavka!A:I,188,8)","v":0},null,{"$f":"IF(INDEX(Objednavka!A:J,188,10)=\"\",\"\",INDEX(Objednavka!A:J,188,10))","v":""}]
[null,{"$f":"IF(INDEX(Objednavka!A:I,189,3)=\"\",INDEX(Objednavka!A:I,189,1),INDEX(Objednavka!A:I,189,3))","v":"Rwanda AA - 20 Kg"},null,null,null,null,null,{"$f":"INDEX(Objednavka!A:I,189,4)","v":3843},null,{"$f":"INDEX(Objednavka!A:I,189,5)","v":4419.45},{"$f":"INDEX(Objednavka!A:I,189,7)","v":0},{"$f":"INDEX(Objednavka!A:I,189,8)","v":0},null,{"$f":"IF(INDEX(Objednavka!A:J,189,10)=\"\",\"\",INDEX(Objednavka!A:J,189,10))","v":""}]
[null,{"$f":"IF(INDEX(Objednavka!A:I,190,3)=\"\",INDEX(Objednavka!A:I,190,1),INDEX(Objednavka!A:I,190,3))","v":"Rwanda AA - 40 Kg"},null,null,null,null,null,{"$f":"INDEX(Objednavka!A:I,190,4)","v":6922},null,{"$f":"INDEX(Objednavka!A:I,190,5)","v":7960.2999999999993},{"$f":"INDEX(Objednavka!A:I,190,7)","v":0},{"$f":"INDEX(Objednavka!A:I,190,8)","v":0},null,{"$f":"IF(INDEX(Objednavka!A:J,190,10)=\"\",\"\",INDEX(Objednavka!A:J,190,10))","v":""}]
[null,{"$f":"IF(INDEX(Objednavka!A:I,191,3)=\"\",INDEX(Objednavka!A:I,191,1),INDEX(Objednavka!A:I,191,3))","v":"Rwanda AA - 60 Kg"},null,null,null,null,null,{"$f":"INDEX(Objednavka!A:I,191,4)","v":9443},null,{"$f":"INDEX(Objednavka!A:I,191,5)","v":10859.449999999999},{"$f":"INDEX(Objednavka!A:I,191,7)","v":0},{"$f":"INDEX(Objednavka!A:I,191,8)","v":0},null,{"$f":"IF(INDEX(Objednavka!A:J,191,10)=\"\",\"\",INDEX(Objednavka!A:J,191,10))","v":""}]
[null,{"$f":"IF(INDEX(Objednavka!A:I,192,3)=\"\",INDEX(Objednavka!A:I,192,1),INDEX(Objednavka!A:I,192,3))","v":"Rwanda AA - 60 Kg - min. odběr 10 pytlů"},null,null,null,null,null,{"$f":"INDEX(Objednavka!A:I,192,4)","v":8818},null,{"$f":"INDEX(Objednavka!A:I,192,5)","v":10140.699999999999},{"$f":"INDEX(Objednavka!A:I,192,7)","v":0},{"$f":"INDEX(Objednavka!A:I,192,8)","v":0},null,{"$f":"IF(INDEX(Objednavka!A:J,192,10)=\"\",\"\",INDEX(Objednavka!A:J,192,10))","v":""}]
[null,{"$f":"IF(INDEX(Objednavka!A:I,193,3)=\"\",INDEX(Objednavka!A:I,193,1),INDEX(Objednavka!A:I,193,3))","v":"Salvador SHG EP Organic - 1 Kg"},null,null,null,null,null,{"$f":"INDEX(Objednavka!A:I,193,4)","v":337},null,{"$f":"INDEX(Objednavka!A:I,193,5)","v":387.54999999999995},{"$f":"INDEX(Objednavka!A:I,193,7)","v":0},{"$f":"INDEX(Objednavka!A:I,193,8)","v":0},null,{"$f":"IF(INDEX(Objednavka!A:J,193,10)=\"\",\"\",INDEX(Objednavka!A:J,193,10))","v":""}]
[null,{"$f":"IF(INDEX(Objednavka!A:I,194,3)=\"\",INDEX(Objednavka!A:I,194,1),INDEX(Objednavka!A:I,194,3))","v":"Salvador SHG EP Organic - 5 Kg"},null,null,null,null,null,{"$f":"INDEX(Objednavka!A:I,194,4)","v":1448},null,{"$f":"INDEX(Objednavka!A:I,194,5)","v":1665.1999999999998},{"$f":"INDEX(Objednavka!A:I,194,7)","v":0},{"$f":"INDEX(Objednavka!A:I,194,8)","v":0},null,{"$f":"IF(INDEX(Objednavka!A:J,194,10)=\"\",\"\",INDEX(Objednavka!A:J,194,10))","v":""}]
[null,{"$f":"IF(INDEX(Objednavka!A:I,195,3)=\"\",INDEX(Objednavka!A:I,195,1),INDEX(Objednavka!A:I,195,3))","v":"Salvador SHG EP Organic - 10 Kg"},null,null,null,null,null,{"$f":"INDEX(Objednavka!A:I,195,4)","v":2539},null,{"$f":"INDEX(Objednavka!A:I,195,5)","v":2919.85},{"$f":"INDEX(Objednavka!A:I,195,7)","v":0},{"$f":"INDEX(Objednavka!A:I,195,8)","v":0},null,{"$f":"IF(INDEX(Objednavka!A:J,195,10)=\"\",\"\",INDEX(Objednavka!A:J,195,10))","v":""}]
[null,{"$f":"IF(INDEX(Objednavka!A:I,196,3)=\"\",INDEX(Objednavka!A:I,196,1),INDEX(Objednavka!A:I,196,3))","v":"Salvador SHG EP Organic - 20 Kg"},null,null,null,null,null,{"$f":"INDEX(Objednavka!A:I,196,4)","v":4522},null,{"$f":"INDEX(Objednavka!A:I,196,5)","v":5200.2999999999993},{"$f":"INDEX(Objednavka!A:I,196,7)","v":0},{"$f":"INDEX(Objednavka!A:I,196,8)","v":0},null,{"$f":"IF(INDEX(Objednavka!A:J,196,10)=\"\",\"\",INDEX(Objednavka!A:J,196,10))","v":""}]
[null,{"$f":"IF(INDEX(Objednavka!A:I,197,3)=\"\",INDEX(Objednavka!A:I,197,1),INDEX(Objednavka!A:I,197,3))","v":"Salvador SHG EP Organic - 40 Kg"},null,null,null,null,null,{"$f":"INDEX(Objednavka!A:I,197,4)","v":8174},null,{"$f":"INDEX(Objednavka!A:I,197,5)","v":9400.0999999999985},{"$f":"INDEX(Objednavka!A:I,197,7)","v":0},{"$f":"INDEX(Objednavka!A:I,197,8)","v":0},null,{"$f":"IF(INDEX(Objednavka!A:J,197,10)=\"\",\"\",INDEX(Objednavka!A:J,197,10))","v":""}]
[null,{"$f":"IF(INDEX(Objednavka!A:I,198,3)=\"\",INDEX(Objednavka!A:I,198,1),INDEX(Objednavka!A:I,198,3))","v":"Salvador SHG EP Organic - 69 Kg"},null,null,null,null,null,{"$f":"INDEX(Objednavka!A:I,198,4)","v":12840},null,{"$f":"INDEX(Objednavka!A:I,198,5)","v":14765.999999999998},{"$f":"INDEX(Objednavka!A:I,198,7)","v":0},{"$f":"INDEX(Objednavka!A:I,198,8)","v":0},null,{"$f":"IF(INDEX(Objednavka!A:J,198,10)=\"\",\"\",INDEX(Objednavka!A:J,198,10))","v":""}]
[null,{"$f":"IF(INDEX(Objednavka!A:I,199,3)=\"\",INDEX(Objednavka!A:I,199,1),INDEX(Objednavka!A:I,199,3))","v":"Salvador SHG EP Organic - 69 Kg - min. odběr 10 pytlů"},null,null,null,null,null,{"$f":"INDEX(Objednavka!A:I,199,4)","v":11940},null,{"$f":"INDEX(Objednavka!A:I,199,5)","v":13730.999999999998},{"$f":"INDEX(Objednavka!A:I,199,7)","v":0},{"$f":"INDEX(Objednavka!A:I,199,8)","v":0},null,{"$f":"IF(INDEX(Objednavka!A:J,199,10)=\"\",\"\",INDEX(Objednavka!A:J,199,10))","v":""}]
[null,{"$f":"IF(INDEX(Objednavka!A:I,200,3)=\"\",INDEX(Objednavka!A:I,200,1),INDEX(Objednavka!A:I,200,3))","v":"Tanzánie - 1 Kg"},null,null,null,null,null,{"$f":"INDEX(Objednavka!A:I,200,4)","v":376},null,{"$f":"INDEX(Objednavka!A:I,200,5)","v":432.4},{"$f":"INDEX(Objednavka!A:I,200,7)","v":0},{"$f":"INDEX(Objednavka!A:I,200,8)","v":0},null,{"$f":"IF(INDEX(Objednavka!A:J,200,10)=\"\",\"\",INDEX(Objednavka!A:J,200,10))","v":""}]
[null,{"$f":"IF(INDEX(Objednavka!A:I,201,3)=\"\",INDEX(Objednavka!A:I,201,1),INDEX(Objednavka!A:I,201,3))","v":"Tanzánie - 5 Kg"},null,null,null,null,null,{"$f":"INDEX(Objednavka!A:I,201,4)","v":1617},null,{"$f":"INDEX(Objednavka!A:I,201,5)","v":1859.55},{"$f":"INDEX(Objednavka!A:I,201,7)","v":0},{"$f":"INDEX(Objednavka!A:I,201,8)","v":0},null,{"$f":"IF(INDEX(Objednavka!A:J,201,10)=\"\",\"\",INDEX(Objednavka!A:J,201,10))","v":""}]
[null,{"$f":"IF(INDEX(Objednavka!A:I,202,3)=\"\",INDEX(Objednavka!A:I,202,1),INDEX(Objednavka!A:I,202,3))","v":"Tanzánie - 10 Kg"},null,null,null,null,null,{"$f":"INDEX(Objednavka!A:I,202,4)","v":2835},null,{"$f":"INDEX(Objednavka!A:I,202,5)","v":3260.2499999999995},{"$f":"INDEX(Objednavka!A:I,202,7)","v":0},{"$f":"INDEX(Objednavka!A:I,202,8)","v":0},null,{"$f":"IF(INDEX(Objednavka!A:J,202,10)=\"\",\"\",INDEX(Objednavka!A:J,202,10))","v":""}]
[null,{"$f":"IF(INDEX(Objednavka!A:I,203,3)=\"\",INDEX(Objednavka!A:I,203,1),INDEX(Objednavka!A:I,203,3))","v":"Tanzánie - 20 Kg"},null,null,null,null,null,{"$f":"INDEX(Objednavka!A:I,203,4)","v":5061},null,{"$f":"INDEX(Objednavka!A:I,203,5)","v":5820.15},{"$f":"INDEX(Objednavka!A:I,203,7)","v":0},{"$f":"INDEX(Objednavka!A:I,203,8)","v":0},null,{"$f":"IF(INDEX(Objednavka!A:J,203,10)=\"\",\"\",INDEX(Objednavka!A:J,203,10))","v":""}]
[null,{"$f":"IF(INDEX(Objednavka!A:I,204,3)=\"\",INDEX(Objednavka!A:I,204,1),INDEX(Objednavka!A:I,204,3))","v":"Tanzánie - 40 Kg"},null,null,null,null,null,{"$f":"INDEX(Objednavka!A:I,204,4)","v":9113},null,{"$f":"INDEX(Objednavka!A:I,204,5)","v":10479.949999999999},{"$f":"INDEX(Objednavka!A:I,204,7)","v":0},{"$f":"INDEX(Objednavka!A:I,204,8)","v":0},null,{"$f":"IF(INDEX(Objednavka!A:J,204,10)=\"\",\"\",INDEX(Objednavka!A:J,204,10))","v":""}]
[null,{"$f":"IF(INDEX(Objednavka!A:I,205,3)=\"\",INDEX(Objednavka!A:I,205,1),INDEX(Objednavka!A:I,205,3))","v":"Tanzánie - 60 Kg"},null,null,null,null,null,{"$f":"INDEX(Objednavka!A:I,205,4)","v":12470},null,{"$f":"INDEX(Objednavka!A:I,205,5)","v":14340.499999999998},{"$f":"INDEX(Objednavka!A:I,205,7)","v":0},{"$f":"INDEX(Objednavka!A:I,205,8)","v":0},null,{"$f":"IF(INDEX(Objednavka!A:J,205,10)=\"\",\"\",INDEX(Objednavka!A:J,205,10))","v":""}]
[null,{"$f":"IF(INDEX(Objednavka!A:I,206,3)=\"\",INDEX(Objednavka!A:I,206,1),INDEX(Objednavka!A:I,206,3))","v":"Tanzánie - 60 Kg - min. odběr 10 pytlů"},null,null,null,null,null,{"$f":"INDEX(Objednavka!A:I,206,4)","v":11582},null,{"$f":"INDEX(Objednavka!A:I,206,5)","v":13319.3},{"$f":"INDEX(Objednavka!A:I,206,7)","v":0},{"$f":"INDEX(Objednavka!A:I,206,8)","v":0},null,{"$f":"IF(INDEX(Objednavka!A:J,206,10)=\"\",\"\",INDEX(Objednavka!A:J,206,10))","v":""}]
[null,{"$f":"IF(INDEX(Objednavka!A:I,207,3)=\"\",INDEX(Objednavka!A:I,207,1),INDEX(Objednavka!A:I,207,3))","v":"Zambia - Peaberry Washed - 1 Kg"},null,null,null,null,null,{"$f":"INDEX(Objednavka!A:I,207,4)","v":450},null,{"$f":"INDEX(Objednavka!A:I,207,5)","v":517.5},{"$f":"INDEX(Objednavka!A:I,207,7)","v":0},{"$f":"INDEX(Objednavka!A:I,207,8)","v":0},null,{"$f":"IF(INDEX(Objednavka!A:J,207,10)=\"\",\"\",INDEX(Objednavka!A:J,207,10))","v":""}]
[null,{"$f":"IF(INDEX(Objednavka!A:I,208,3)=\"\",INDEX(Objednavka!A:I,208,1),INDEX(Objednavka!A:I,208,3))","v":"Zambia - Peaberry Washed - 5 Kg"},null,null,null,null,null,{"$f":"INDEX(Objednavka!A:I,208,4)","v":1939},null,{"$f":"INDEX(Objednavka!A:I,208,5)","v":2229.85},{"$f":"INDEX(Objednavka!A:I,208,7)","v":0},{"$f":"INDEX(Objednavka!A:I,208,8)","v":0},null,{"$f":"IF(INDEX(Objednavka!A:J,208,10)=\"\",\"\",INDEX(Objednavka!A:J,208,10))","v":""}]
[null,{"$f":"IF(INDEX(Objednavka!A:I,209,3)=\"\",INDEX(Objednavka!A:I,209,1),INDEX(Objednavka!A:I,209,3))","v":"Zambia - Peaberry Washed - 10 Kg"},null,null,null,null,null,{"$f":"INDEX(Objednavka!A:I,209,4)","v":3400},null,{"$f":"INDEX(Objednavka!A:I,209,5)","v":3909.9999999999995},{"$f":"INDEX(Objednavka!A:I,209,7)","v":0},{"$f":"INDEX(Objednavka!A:I,209,8)","v":0},null,{"$f":"IF(INDEX(Objednavka!A:J,209,10)=\"\",\"\",INDEX(Objednavka!A:J,209,10))","v":""}]
[null,{"$f":"IF(INDEX(Objednavka!A:I,210,3)=\"\",INDEX(Objednavka!A:I,210,1),INDEX(Objednavka!A:I,210,3))","v":"Zambia - Peaberry Washed - 20 Kg"},null,null,null,null,null,{"$f":"INDEX(Objednavka!A:I,210,4)","v":6052},null,{"$f":"INDEX(Objednavka!A:I,210,5)","v":6959.7999999999993},{"$f":"INDEX(Objednavka!A:I,210,7)","v":0},{"$f":"INDEX(Objednavka!A:I,210,8)","v":0},null,{"$f":"IF(INDEX(Objednavka!A:J,210,10)=\"\",\"\",INDEX(Objednavka!A:J,210,10))","v":""}]
[null,{"$f":"IF(INDEX(Objednavka!A:I,211,3)=\"\",INDEX(Objednavka!A:I,211,1),INDEX(Objednavka!A:I,211,3))","v":"Zambia - Peaberry Washed - 40 Kg"},null,null,null,null,null,{"$f":"INDEX(Objednavka!A:I,211,4)","v":10922},null,{"$f":"INDEX(Objednavka!A:I,211,5)","v":12560.3},{"$f":"INDEX(Objednavka!A:I,211,7)","v":0},{"$f":"INDEX(Objednavka!A:I,211,8)","v":0},null,{"$f":"IF(INDEX(Objednavka!A:J,211,10)=\"\",\"\",INDEX(Objednavka!A:J,211,10))","v":""}]
[null,{"$f":"IF(INDEX(Objednavka!A:I,212,3)=\"\",INDEX(Objednavka!A:I,212,1),INDEX(Objednavka!A:I,212,3))","v":"Zambia - Peaberry Washed - 60 Kg"},null,null,null,null,null,{"$f":"INDEX(Objednavka!A:I,212,4)","v":14922},null,{"$f":"INDEX(Objednavka!A:I,212,5)","v":17160.3},{"$f":"INDEX(Objednavka!A:I,212,7)","v":0},{"$f":"INDEX(Objednavka!A:I,212,8)","v":0},null,{"$f":"IF(INDEX(Objednavka!A:J,212,10)=\"\",\"\",INDEX(Objednavka!A:J,212,10))","v":""}]
[null,{"$f":"IF(INDEX(Objednavka!A:I,213,3)=\"\",INDEX(Objednavka!A:I,213,1),INDEX(Objednavka!A:I,213,3))","v":"Zambia - Peaberry Washed - 60 Kg - min. odběr 10 pytlů"},null,null,null,null,null,{"$f":"INDEX(Objednavka!A:I,213,4)","v":13878},null,{"$f":"INDEX(Objednavka!A:I,213,5)","v":15959.699999999999},{"$f":"INDEX(Objednavka!A:I,213,7)","v":0},{"$f":"INDEX(Objednavka!A:I,213,8)","v":0},null,{"$f":"IF(INDEX(Objednavka!A:J,213,10)=\"\",\"\",INDEX(Objednavka!A:J,213,10))","v":""}]
[null,{"$f":"IF(INDEX(Objednavka!A:I,214,3)=\"\",INDEX(Objednavka!A:I,214,1),INDEX(Objednavka!A:I,214,3))","v":0},null,null,null,null,null,{"$f":"INDEX(Objednavka!A:I,214,4)","v":0},null,{"$f":"INDEX(Objednavka!A:I,214,5)","v":0},{"$f":"INDEX(Objednavka!A:I,214,7)","v":0},{"$f":"INDEX(Objednavka!A:I,214,8)","v":0},null,{"$f":"IF(INDEX(Objednavka!A:J,214,10)=\"\",\"\",INDEX(Objednavka!A:J,214,10))","v":""}]
[null,{"$f":"IF(INDEX(Objednavka!A:I,215,3)=\"\",INDEX(Objednavka!A:I,215,1),INDEX(Objednavka!A:I,215,3))","v":"Robusty"},null,null,null,null,null,{"$f":"INDEX(Objednavka!A:I,215,4)","v":0},null,{"$f":"INDEX(Objednavka!A:I,215,5)","v":0},{"$f":"INDEX(Objednavka!A:I,215,7)","v":0},{"$f":"INDEX(Objednavka!A:I,215,8)","v":0},null,{"$f":"IF(INDEX(Objednavka!A:J,215,10)=\"\",\"\",INDEX(Objednavka!A:J,215,10))","v":""}]
[null,{"$f":"IF(INDEX(Objednavka!A:I,216,3)=\"\",INDEX(Objednavka!A:I,216,1),INDEX(Objednavka!A:I,216,3))","v":"Robusta India Cherry AB - 1 Kg"},null,null,null,null,null,{"$f":"INDEX(Objednavka!A:I,216,4)","v":152},null,{"$f":"INDEX(Objednavka!A:I,216,5)","v":174.79999999999998},{"$f":"INDEX(Objednavka!A:I,216,7)","v":0},{"$f":"INDEX(Objednavka!A:I,216,8)","v":0},null,{"$f":"IF(INDEX(Objednavka!A:J,216,10)=\"\",\"\",INDEX(Objednavka!A:J,216,10))","v":""}]
[null,{"$f":"IF(INDEX(Objednavka!A:I,217,3)=\"\",INDEX(Objednavka!A:I,217,1),INDEX(Objednavka!A:I,217,3))","v":"Robusta India Cherry AB - 5 Kg"},null,null,null,null,null,{"$f":"INDEX(Objednavka!A:I,217,4)","v":657},null,{"$f":"INDEX(Objednavka!A:I,217,5)","v":755.55},{"$f":"INDEX(Objednavka!A:I,217,7)","v":0},{"$f":"INDEX(Objednavka!A:I,217,8)","v":0},null,{"$f":"IF(INDEX(Objednavka!A:J,217,10)=\"\",\"\",INDEX(Objednavka!A:J,217,10))","v":""}]
[null,{"$f":"IF(INDEX(Objednavka!A:I,218,3)=\"\",INDEX(Objednavka!A:I,218,1),INDEX(Objednavka!A:I,218,3))","v":"Robusta India Cherry AB - 10 Kg"},null,null,null,null,null,{"$f":"INDEX(Objednavka!A:I,218,4)","v":1148},null,{"$f":"INDEX(Objednavka!A:I,218,5)","v":1320.1999999999998},{"$f":"INDEX(Objednavka!A:I,218,7)","v":0},{"$f":"INDEX(Objednavka!A:I,218,8)","v":0},null,{"$f":"IF(INDEX(Objednavka!A:J,218,10)=\"\",\"\",INDEX(Objednavka!A:J,218,10))","v":""}]
[null,{"$f":"IF(INDEX(Objednavka!A:I,219,3)=\"\",INDEX(Objednavka!A:I,219,1),INDEX(Objednavka!A:I,219,3))","v":"Robusta India Cherry AB - 20 Kg"},null,null,null,null,null,{"$f":"INDEX(Objednavka!A:I,219,4)","v":2052},null,{"$f":"INDEX(Objednavka!A:I,219,5)","v":2359.7999999999997},{"$f":"INDEX(Objednavka!A:I,219,7)","v":0},{"$f":"INDEX(Objednavka!A:I,219,8)","v":0},null,{"$f":"IF(INDEX(Objednavka!A:J,219,10)=\"\",\"\",INDEX(Objednavka!A:J,219,10))","v":""}]
[null,{"$f":"IF(INDEX(Objednavka!A:I,220,3)=\"\",INDEX(Objednavka!A:I,220,1),INDEX(Objednavka!A:I,220,3))","v":"Robusta India Cherry AB - 40 Kg"},null,null,null,null,null,{"$f":"INDEX(Objednavka!A:I,220,4)","v":3687},null,{"$f":"INDEX(Objednavka!A:I,220,5)","v":4240.0499999999993},{"$f":"INDEX(Objednavka!A:I,220,7)","v":0},{"$f":"INDEX(Objednavka!A:I,220,8)","v":0},null,{"$f":"IF(INDEX(Objednavka!A:J,220,10)=\"\",\"\",INDEX(Objednavka!A:J,220,10))","v":""}]
[null,{"$f":"IF(INDEX(Objednavka!A:I,221,3)=\"\",INDEX(Objednavka!A:I,221,1),INDEX(Objednavka!A:I,221,3))","v":"Robusta India Cherry AB - 60 Kg"},null,null,null,null,null,{"$f":"INDEX(Objednavka!A:I,221,4)","v":5061},null,{"$f":"INDEX(Objednavka!A:I,221,5)","v":5820.15},{"$f":"INDEX(Objednavka!A:I,221,7)","v":0},{"$f":"INDEX(Objednavka!A:I,221,8)","v":0},null,{"$f":"IF(INDEX(Objednavka!A:J,221,10)=\"\",\"\",INDEX(Objednavka!A:J,221,10))","v":""}]
[null,{"$f":"IF(INDEX(Objednavka!A:I,222,3)=\"\",INDEX(Objednavka!A:I,222,1),INDEX(Objednavka!A:I,222,3))","v":"Robusta India Cherry AB - 60 Kg - min. odběr 10 pytlů"},null,null,null,null,null,{"$f":"INDEX(Objednavka!A:I,222,4)","v":4696},null,{"$f":"INDEX(Objednavka!A:I,222,5)","v":5400.4},{"$f":"INDEX(Objednavka!A:I,222,7)","v":0},{"$f":"INDEX(Objednavka!A:I,222,8)","v":0},null,{"$f":"IF(INDEX(Objednavka!A:J,222,10)=\"\",\"\",INDEX(Objednavka!A:J,222,10))","v":""}]
[null,{"$f":"IF(INDEX(Objednavka!A:I,223,3)=\"\",INDEX(Objednavka!A:I,223,1),INDEX(Objednavka!A:I,223,3))","v":"Robusta India Monsooned AA - 1 Kg"},null,null,null,null,null,{"$f":"INDEX(Objednavka!A:I,223,4)","v":245},null,{"$f":"INDEX(Objednavka!A:I,223,5)","v":281.75},{"$f":"INDEX(Objednavka!A:I,223,7)","v":0},{"$f":"INDEX(Objednavka!A:I,223,8)","v":0},null,{"$f":"IF(INDEX(Objednavka!A:J,223,10)=\"\",\"\",INDEX(Objednavka!A:J,223,10))","v":""}]
[null,{"$f":"IF(INDEX(Objednavka!A:I,224,3)=\"\",INDEX(Objednavka!A:I,224,1),INDEX(Objednavka!A:I,224,3))","v":"Robusta India Monsooned AA - 5 Kg"},null,null,null,null,null,{"$f":"INDEX(Objednavka!A:I,224,4)","v":1057},null,{"$f":"INDEX(Objednavka!A:I,224,5)","v":1215.55},{"$f":"INDEX(Objednavka!A:I,224,7)","v":0},{"$f":"INDEX(Objednavka!A:I,224,8)","v":0},null,{"$f":"IF(INDEX(Objednavka!A:J,224,10)=\"\",\"\",INDEX(Objednavka!A:J,224,10))","v":""}]
[null,{"$f":"IF(INDEX(Objednavka!A:I,225,3)=\"\",INDEX(Objednavka!A:I,225,1),INDEX(Objednavka!A:I,225,3))","v":"Robusta India Monsooned AA - 10 Kg"},null,null,null,null,null,{"$f":"INDEX(Objednavka!A:I,225,4)","v":1852},null,{"$f":"INDEX(Objednavka!A:I,225,5)","v":2129.7999999999997},{"$f":"INDEX(Objednavka!A:I,225,7)","v":0},{"$f":"INDEX(Objednavka!A:I,225,8)","v":0},null,{"$f":"IF(INDEX(Objednavka!A:J,225,10)=\"\",\"\",INDEX(Objednavka!A:J,225,10))","v":""}]
[null,{"$f":"IF(INDEX(Objednavka!A:I,226,3)=\"\",INDEX(Objednavka!A:I,226,1),INDEX(Objednavka!A:I,226,3))","v":"Robusta India Monsooned AA - 20 Kg"},null,null,null,null,null,{"$f":"INDEX(Objednavka!A:I,226,4)","v":3304},null,{"$f":"INDEX(Objednavka!A:I,226,5)","v":3799.6},{"$f":"INDEX(Objednavka!A:I,226,7)","v":0},{"$f":"INDEX(Objednavka!A:I,226,8)","v":0},null,{"$f":"IF(INDEX(Objednavka!A:J,226,10)=\"\",\"\",INDEX(Objednavka!A:J,226,10))","v":""}]
[null,{"$f":"IF(INDEX(Objednavka!A:I,227,3)=\"\",INDEX(Objednavka!A:I,227,1),INDEX(Objednavka!A:I,227,3))","v":"Robusta India Monsooned AA - 40 Kg"},null,null,null,null,null,{"$f":"INDEX(Objednavka!A:I,227,4)","v":5948},null,{"$f":"INDEX(Objednavka!A:I,227,5)","v":6840.2},{"$f":"INDEX(Objednavka!A:I,227,7)","v":0},{"$f":"INDEX(Objednavka!A:I,227,8)","v":0},null,{"$f":"IF(INDEX(Objednavka!A:J,227,10)=\"\",\"\",INDEX(Objednavka!A:J,227,10))","v":""}]
[null,{"$f":"IF(INDEX(Objednavka!A:I,228,3)=\"\",INDEX(Objednavka!A:I,228,1),INDEX(Objednavka!A:I,228,3))","v":"Robusta India Monsooned AA - 60 Kg"},null,null,null,null,null,{"$f":"INDEX(Objednavka!A:I,228,4)","v":8139},null,{"$f":"INDEX(Objednavka!A:I,228,5)","v":9359.8499999999985},{"$f":"INDEX(Objednavka!A:I,228,7)","v":0},{"$f":"INDEX(Objednavka!A:I,228,8)","v":0},null,{"$f":"IF(INDEX(Objednavka!A:J,228,10)=\"\",\"\",INDEX(Objednavka!A:J,228,10))","v":""}]
[null,{"$f":"IF(INDEX(Objednavka!A:I,229,3)=\"\",INDEX(Objednavka!A:I,229,1),INDEX(Objednavka!A:I,229,3))","v":"Robusta India Monsooned AA - 60 Kg - min. odběr 10 pytlů"},null,null,null,null,null,{"$f":"INDEX(Objednavka!A:I,229,4)","v":7565},null,{"$f":"INDEX(Objednavka!A:I,229,5)","v":8699.75},{"$f":"INDEX(Objednavka!A:I,229,7)","v":0},{"$f":"INDEX(Objednavka!A:I,229,8)","v":0},null,{"$f":"IF(INDEX(Objednavka!A:J,229,10)=\"\",\"\",INDEX(Objednavka!A:J,229,10))","v":""}]
[null,{"$f":"IF(INDEX(Objednavka!A:I,230,3)=\"\",INDEX(Objednavka!A:I,230,1),INDEX(Objednavka!A:I,230,3))","v":"Robusta India Washed - 1 Kg"},null,null,null,null,null,{"$f":"INDEX(Objednavka!A:I,230,4)","v":212},null,{"$f":"INDEX(Objednavka!A:I,230,5)","v":243.79999999999998},{"$f":"INDEX(Objednavka!A:I,230,7)","v":0},{"$f":"INDEX(Objednavka!A:I,230,8)","v":0},null,{"$f":"IF(INDEX(Objednavka!A:J,230,10)=\"\",\"\",INDEX(Objednavka!A:J,230,10))","v":""}]
[null,{"$f":"IF(INDEX(Objednavka!A:I,231,3)=\"\",INDEX(Objednavka!A:I,231,1),INDEX(Objednavka!A:I,231,3))","v":"Robusta India Washed - 5 Kg"},null,null,null,null,null,{"$f":"INDEX(Objednavka!A:I,231,4)","v":913},null,{"$f":"INDEX(Objednavka!A:I,231,5)","v":1049.9499999999998},{"$f":"INDEX(Objednavka!A:I,231,7)","v":0},{"$f":"INDEX(Objednavka!A:I,231,8)","v":0},null,{"$f":"IF(INDEX(Objednavka!A:J,231,10)=\"\",\"\",INDEX(Objednavka!A:J,231,10))","v":""}]
[null,{"$f":"IF(INDEX(Objednavka!A:I,232,3)=\"\",INDEX(Objednavka!A:I,232,1),INDEX(Objednavka!A:I,232,3))","v":"Robusta India Washed - 10 Kg"},null,null,null,null,null,{"$f":"INDEX(Objednavka!A:I,232,4)","v":1600},null,{"$f":"INDEX(Objednavka!A:I,232,5)","v":1839.9999999999998},{"$f":"INDEX(Objednavka!A:I,232,7)","v":0},{"$f":"INDEX(Objednavka!A:I,232,8)","v":0},null,{"$f":"IF(INDEX(Objednavka!A:J,232,10)=\"\",\"\",INDEX(Objednavka!A:J,232,10))","v":""}]
[null,{"$f":"IF(INDEX(Objednavka!A:I,233,3)=\"\",INDEX(Objednavka!A:I,233,1),INDEX(Objednavka!A:I,233,3))","v":"Robusta India Washed - 20 Kg"},null,null,null,null,null,{"$f":"INDEX(Objednavka!A:I,233,4)","v":2852},null,{"$f":"INDEX(Objednavka!A:I,233,5)","v":3279.7999999999997},{"$f":"INDEX(Objednavka!A:I,233,7)","v":0},{"$f":"INDEX(Objednavka!A:I,233,8)","v":0},null,{"$f":"IF(INDEX(Objednavka!A:J,233,10)=\"\",\"\",INDEX(Objednavka!A:J,233,10))","v":""}]
[null,{"$f":"IF(INDEX(Objednavka!A:I,234,3)=\"\",INDEX(Objednavka!A:I,234,1),INDEX(Objednavka!A:I,234,3))","v":"Robusta India Washed - 40 Kg"},null,null,null,null,null,{"$f":"INDEX(Objednavka!A:I,234,4)","v":5148},null,{"$f":"INDEX(Objednavka!A:I,234,5)","v":5920.2},{"$f":"INDEX(Objednavka!A:I,234,7)","v":0},{"$f":"INDEX(Objednavka!A:I,234,8)","v":0},null,{"$f":"IF(INDEX(Objednavka!A:J,234,10)=\"\",\"\",INDEX(Objednavka!A:J,234,10))","v":""}]
[null,{"$f":"IF(INDEX(Objednavka!A:I,235,3)=\"\",INDEX(Objednavka!A:I,235,1),INDEX(Objednavka!A:I,235,3))","v":"Robusta India Washed - 60 Kg"},null,null,null,null,null,{"$f":"INDEX(Objednavka!A:I,235,4)","v":7043},null,{"$f":"INDEX(Objednavka!A:I,235,5)","v":8099.45},{"$f":"INDEX(Objednavka!A:I,235,7)","v":0},{"$f":"INDEX(Objednavka!A:I,235,8)","v":0},null,{"$f":"IF(INDEX(Objednavka!A:J,235,10)=\"\",\"\",INDEX(Objednavka!A:J,235,10))","v":""}]
[null,{"$f":"IF(INDEX(Objednavka!A:I,236,3)=\"\",INDEX(Objednavka!A:I,236,1),INDEX(Objednavka!A:I,236,3))","v":"Robusta India Washed - 60 Kg - min. odběr 10 pytlů"},null,null,null,null,null,{"$f":"INDEX(Objednavka!A:I,236,4)","v":6574},null,{"$f":"INDEX(Objednavka!A:I,236,5)","v":7560.0999999999995},{"$f":"INDEX(Objednavka!A:I,236,7)","v":0},{"$f":"INDEX(Objednavka!A:I,236,8)","v":0},null,{"$f":"IF(INDEX(Objednavka!A:J,236,10)=\"\",\"\",INDEX(Objednavka!A:J,236,10))","v":""}]
[null,{"$f":"IF(INDEX(Objednavka!A:I,237,3)=\"\",INDEX(Objednavka!A:I,237,1),INDEX(Objednavka!A:I,237,3))","v":"Robusta Vietnam - 1 Kg"},null,null,null,null,null,{"$f":"INDEX(Objednavka!A:I,237,4)","v":158},null,{"$f":"INDEX(Objednavka!A:I,237,5)","v":181.7},{"$f":"INDEX(Objednavka!A:I,237,7)","v":0},{"$f":"INDEX(Objednavka!A:I,237,8)","v":0},null,{"$f":"IF(INDEX(Objednavka!A:J,237,10)=\"\",\"\",INDEX(Objednavka!A:J,237,10))","v":""}]
[null,{"$f":"IF(INDEX(Objednavka!A:I,238,3)=\"\",INDEX(Objednavka!A:I,238,1),INDEX(Objednavka!A:I,238,3))","v":"Robusta Vietnam - 5 Kg"},null,null,null,null,null,{"$f":"INDEX(Objednavka!A:I,238,4)","v":679},null,{"$f":"INDEX(Objednavka!A:I,238,5)","v":780.84999999999991},{"$f":"INDEX(Objednavka!A:I,238,7)","v":0},{"$f":"INDEX(Objednavka!A:I,238,8)","v":0},null,{"$f":"IF(INDEX(Objednavka!A:J,238,10)=\"\",\"\",INDEX(Objednavka!A:J,238,10))","v":""}]
[null,{"$f":"IF(INDEX(Objednavka!A:I,239,3)=\"\",INDEX(Objednavka!A:I,239,1),INDEX(Objednavka!A:I,239,3))","v":"Robusta Vietnam - 10 Kg"},null,null,null,null,null,{"$f":"INDEX(Objednavka!A:I,239,4)","v":1191},null,{"$f":"INDEX(Objednavka!A:I,239,5)","v":1369.6499999999999},{"$f":"INDEX(Objednavka!A:I,239,7)","v":0},{"$f":"INDEX(Objednavka!A:I,239,8)","v":0},null,{"$f":"IF(INDEX(Objednavka!A:J,239,10)=\"\",\"\",INDEX(Objednavka!A:J,239,10))","v":""}]
[null,{"$f":"IF(INDEX(Objednavka!A:I,240,3)=\"\",INDEX(Objednavka!A:I,240,1),INDEX(Objednavka!A:I,240,3))","v":"Robusta Vietnam - 20 Kg"},null,null,null,null,null,{"$f":"INDEX(Objednavka!A:I,240,4)","v":2122},null,{"$f":"INDEX(Objednavka!A:I,240,5)","v":2440.2999999999997},{"$f":"INDEX(Objednavka!A:I,240,7)","v":0},{"$f":"INDEX(Objednavka!A:I,240,8)","v":0},null,{"$f":"IF(INDEX(Objednavka!A:J,240,10)=\"\",\"\",INDEX(Objednavka!A:J,240,10))","v":""}]
[null,{"$f":"IF(INDEX(Objednavka!A:I,241,3)=\"\",INDEX(Objednavka!A:I,241,1),INDEX(Objednavka!A:I,241,3))","v":"Robusta Vietnam - 40 Kg"},null,null,null,null,null,{"$f":"INDEX(Objednavka!A:I,241,4)","v":3826},null,{"$f":"INDEX(Objednavka!A:I,241,5)","v":4399.8999999999996},{"$f":"INDEX(Objednavka!A:I,241,7)","v":0},{"$f":"INDEX(Objednavka!A:I,241,8)","v":0},null,{"$f":"IF(INDEX(Objednavka!A:J,241,10)=\"\",\"\",INDEX(Objednavka!A:J,241,10))","v":""}]
[null,{"$f":"IF(INDEX(Objednavka!A:I,242,3)=\"\",INDEX(Objednavka!A:I,242,1),INDEX(Objednavka!A:I,242,3))","v":"Robusta Vietnam - 60 Kg"},null,null,null,null,null,{"$f":"INDEX(Objednavka!A:I,242,4)","v":5270},null,{"$f":"INDEX(Objednavka!A:I,242,5)","v":6060.4999999999991},{"$f":"INDEX(Objednavka!A:I,242,7)","v":0},{"$f":"INDEX(Objednavka!A:I,242,8)","v":0},null,{"$f":"IF(INDEX(Objednavka!A:J,242,10)=\"\",\"\",INDEX(Objednavka!A:J,242,10))","v":""}]
[null,{"$f":"IF(INDEX(Objednavka!A:I,243,3)=\"\",INDEX(Objednavka!A:I,243,1),INDEX(Objednavka!A:I,243,3))","v":"Robusta Vietnam - 60 Kg - min. odběr 10 pytlů"},null,null,null,null,null,{"$f":"INDEX(Objednavka!A:I,243,4)","v":4904},null,{"$f":"INDEX(Objednavka!A:I,243,5)","v":5639.5999999999995},{"$f":"INDEX(Objednavka!A:I,243,7)","v":0},{"$f":"INDEX(Objednavka!A:I,243,8)","v":0},null,{"$f":"IF(INDEX(Objednavka!A:J,243,10)=\"\",\"\",INDEX(Objednavka!A:J,243,10))","v":""}]
[null,{"$f":"IF(INDEX(Objednavka!A:I,244,3)=\"\",INDEX(Objednavka!A:I,244,1),INDEX(Objednavka!A:I,244,3))","v":0},null,null,null,null,null,{"$f":"INDEX(Objednavka!A:I,244,4)","v":0},null,{"$f":"INDEX(Objednavka!A:I,244,5)","v":0},{"$f":"INDEX(Objednavka!A:I,244,7)","v":0},{"$f":"INDEX(Objednavka!A:I,244,8)","v":0},null,{"$f":"IF(INDEX(Objednavka!A:J,244,10)=\"\",\"\",INDEX(Objednavka!A:J,244,10))","v":""}]
[null,{"$f":"IF(INDEX(Objednavka!A:I,245,3)=\"\",INDEX(Objednavka!A:I,245,1),INDEX(Objednavka!A:I,245,3))","v":0},null,null,null,null,null,{"$f":"INDEX(Objednavka!A:I,245,4)","v":0},null,{"$f":"INDEX(Objednavka!A:I,245,5)","v":0},{"$f":"INDEX(Objednavka!A:I,245,7)","v":0},{"$f":"INDEX(Objednavka!A:I,245,8)","v":0},null,{"$f":"IF(INDEX(Objednavka!A:J,245,10)=\"\",\"\",INDEX(Objednavka!A:J,245,10))","v":""}]
[null,{"$f":"IF(INDEX(Objednavka!A:I,246,3)=\"\",INDEX(Objednavka!A:I,246,1),INDEX(Objednavka!A:I,246,3))","v":0},null,null,null,null,null,{"$f":"INDEX(Objednavka!A:I,246,4)","v":0},null,{"$f":"INDEX(Objednavka!A:I,246,5)","v":0},{"$f":"INDEX(Objednavka!A:I,246,7)","v":0},{"$f":"INDEX(Objednavka!A:I,246,8)","v":0},null,{"$f":"IF(INDEX(Objednavka!A:J,246,10)=\"\",\"\",INDEX(Objednavka!A:J,246,10))","v":""}]
[null,{"$f":"IF(INDEX(Objednavka!A:I,247,3)=\"\",INDEX(Objednavka!A:I,247,1),INDEX(Objednavka!A:I,247,3))","v":0},null,null,null,null,null,{"$f":"INDEX(Objednavka!A:I,247,4)","v":0},null,{"$f":"INDEX(Objednavka!A:I,247,5)","v":0},{"$f":"INDEX(Objednavka!A:I,247,7)","v":0},{"$f":"INDEX(Objednavka!A:I,247,8)","v":0},null,{"$f":"IF(INDEX(Objednavka!A:J,247,10)=\"\",\"\",INDEX(Objednavka!A:J,247,10))","v":""}]
[null,{"$f":"IF(INDEX(Objednavka!A:I,248,3)=\"\",INDEX(Objednavka!A:I,248,1),INDEX(Objednavka!A:I,248,3))","v":0},null,null,null,null,null,{"$f":"INDEX(Objednavka!A:I,248,4)","v":0},null,{"$f":"INDEX(Objednavka!A:I,248,5)","v":0},{"$f":"INDEX(Objednavka!A:I,248,7)","v":0},{"$f":"INDEX(Objednavka!A:I,248,8)","v":0},null,{"$f":"IF(INDEX(Objednavka!A:J,248,10)=\"\",\"\",INDEX(Objednavka!A:J,248,10))","v":""}]
[null,{"$f":"IF(INDEX(Objednavka!A:I,249,3)=\"\",INDEX(Objednavka!A:I,249,1),INDEX(Objednavka!A:I,249,3))","v":0},null,null,null,null,null,{"$f":"INDEX(Objednavka!A:I,249,4)","v":0},null,{"$f":"INDEX(Objednavka!A:I,249,5)","v":0},{"$f":"INDEX(Objednavka!A:I,249,7)","v":0},{"$f":"INDEX(Objednavka!A:I,249,8)","v":0},null,{"$f":"IF(INDEX(Objednavka!A:J,249,10)=\"\",\"\",INDEX(Objednavka!A:J,249,10))","v":""}]
[null,{"$f":"IF(INDEX(Objednavka!A:I,250,3)=\"\",INDEX(Objednavka!A:I,250,1),INDEX(Objednavka!A:I,250,3))","v":0},null,null,null,null,null,{"$f":"INDEX(Objednavka!A:I,250,4)","v":0},null,{"$f":"INDEX(Objednavka!A:I,250,5)","v":0},{"$f":"INDEX(Objednavka!A:I,250,7)","v":0},{"$f":"INDEX(Objednavka!A:I,250,8)","v":0},null,{"$f":"IF(INDEX(Objednavka!A:J,250,10)=\"\",\"\",INDEX(Objednavka!A:J,250,10))","v":""}]
[null,{"$f":"IF(INDEX(Objednavka!A:I,251,3)=\"\",INDEX(Objednavka!A:I,251,1),INDEX(Objednavka!A:I,251,3))","v":0},null,null,null,null,null,{"$f":"INDEX(Objednavka!A:I,251,4)","v":0},null,{"$f":"INDEX(Objednavka!A:I,251,5)","v":0},{"$f":"INDEX(Objednavka!A:I,251,7)","v":0},{"$f":"INDEX(Objednavka!A:I,251,8)","v":0},null,{"$f":"IF(INDEX(Objednavka!A:J,251,10)=\"\",\"\",INDEX(Objednavka!A:J,251,10))","v":""}]
[null,{"$f":"IF(INDEX(Objednavka!A:I,252,3)=\"\",INDEX(Objednavka!A:I,252,1),INDEX(Objednavka!A:I,252,3))","v":0},null,null,null,null,null,{"$f":"INDEX(Objednavka!A:I,252,4)","v":0},null,{"$f":"INDEX(Objednavka!A:I,252,5)","v":0},{"$f":"INDEX(Objednavka!A:I,252,7)","v":0},{"$f":"INDEX(Objednavka!A:I,252,8)","v":0},null,{"$f":"IF(INDEX(Objednavka!A:J,252,10)=\"\",\"\",INDEX(Objednavka!A:J,252,10))","v":""}]
[null,{"$f":"IF(INDEX(Objednavka!A:I,253,3)=\"\",INDEX(Objednavka!A:I,253,1),INDEX(Objednavka!A:I,253,3))","v":0},null,null,null,null,null,{"$f":"INDEX(Objednavka!A:I,253,4)","v":0},null,{"$f":"INDEX(Objednavka!A:I,253,5)","v":0},{"$f":"INDEX(Objednavka!A:I,253,7)","v":0},{"$f":"INDEX(Objednavka!A:I,253,8)","v":0},null,{"$f":"IF(INDEX(Objednavka!A:J,253,10)=\"\",\"\",INDEX(Objednavka!A:J,253,10))","v":""}]
[null,{"$f":"IF(INDEX(Objednavka!A:I,254,3)=\"\",INDEX(Objednavka!A:I,254,1),INDEX(Objednavka!A:I,254,3))","v":0},null,null,null,null,null,{"$f":"INDEX(Objednavka!A:I,254,4)","v":0},null,{"$f":"INDEX(Objednavka!A:I,254,5)","v":0},{"$f":"INDEX(Objednavka!A:I,254,7)","v":0},{"$f":"INDEX(Objednavka!A:I,254,8)","v":0},null,{"$f":"IF(INDEX(Objednavka!A:J,254,10)=\"\",\"\",INDEX(Objednavka!A:J,254,10))","v":""}]
[null,{"$f":"IF(INDEX(Objednavka!A:I,255,3)=\"\",INDEX(Objednavka!A:I,255,1),INDEX(Objednavka!A:I,255,3))","v":0},null,null,null,null,null,{"$f":"INDEX(Objednavka!A:I,255,4)","v":0},null,{"$f":"INDEX(Objednavka!A:I,255,5)","v":0},{"$f":"INDEX(Objednavka!A:I,255,7)","v":0},{"$f":"INDEX(Objednavka!A:I,255,8)","v":0},null,{"$f":"IF(INDEX(Objednavka!A:J,255,10)=\"\",\"\",INDEX(Objednavka!A:J,255,10))","v":""}]
[null,{"$f":"IF(INDEX(Objednavka!A:I,256,3)=\"\",INDEX(Objednavka!A:I,256,1),INDEX(Objednavka!A:I,256,3))","v":0},null,null,null,null,null,{"$f":"INDEX(Objednavka!A:I,256,4)","v":0},null,{"$f":"INDEX(Objednavka!A:I,256,5)","v":0},{"$f":"INDEX(Objednavka!A:I,256,7)","v":0},{"$f":"INDEX(Objednavka!A:I,256,8)","v":0},null,{"$f":"IF(INDEX(Objednavka!A:J,256,10)=\"\",\"\",INDEX(Objednavka!A:J,256,10))","v":""}]
[null,{"$f":"IF(INDEX(Objednavka!A:I,257,3)=\"\",INDEX(Objednavka!A:I,257,1),INDEX(Objednavka!A:I,257,3))","v":0},null,null,null,null,null,{"$f":"INDEX(Objednavka!A:I,257,4)","v":0},null,{"$f":"INDEX(Objednavka!A:I,257,5)","v":0},{"$f":"INDEX(Objednavka!A:I,257,7)","v":0},{"$f":"INDEX(Objednavka!A:I,257,8)","v":0},null,{"$f":"IF(INDEX(Objednavka!A:J,257,10)=\"\",\"\",INDEX(Objednavka!A:J,257,10))","v":""}]
[null,{"$f":"IF(INDEX(Objednavka!A:I,258,3)=\"\",INDEX(Objednavka!A:I,258,1),INDEX(Objednavka!A:I,258,3))","v":0},null,null,null,null,null,{"$f":"INDEX(Objednavka!A:I,258,4)","v":0},null,{"$f":"INDEX(Objednavka!A:I,258,5)","v":0},{"$f":"INDEX(Objednavka!A:I,258,7)","v":0},{"$f":"INDEX(Objednavka!A:I,258,8)","v":0},null,{"$f":"IF(INDEX(Objednavka!A:J,258,10)=\"\",\"\",INDEX(Objednavka!A:J,258,10))","v":""}]
[null,{"$f":"IF(INDEX(Objednavka!A:I,259,3)=\"\",INDEX(Objednavka!A:I,259,1),INDEX(Objednavka!A:I,259,3))","v":0},null,null,null,null,null,{"$f":"INDEX(Objednavka!A:I,259,4)","v":0},null,{"$f":"INDEX(Objednavka!A:I,259,5)","v":0},{"$f":"INDEX(Objednavka!A:I,259,7)","v":0},{"$f":"INDEX(Objednavka!A:I,259,8)","v":0},null,{"$f":"IF(INDEX(Objednavka!A:J,259,10)=\"\",\"\",INDEX(Objednavka!A:J,259,10))","v":""}]
[null,{"$f":"IF(INDEX(Objednavka!A:I,260,3)=\"\",INDEX(Objednavka!A:I,260,1),INDEX(Objednavka!A:I,260,3))","v":0},null,null,null,null,null,{"$f":"INDEX(Objednavka!A:I,260,4)","v":0},null,{"$f":"INDEX(Objednavka!A:I,260,5)","v":0},{"$f":"INDEX(Objednavka!A:I,260,7)","v":0},{"$f":"INDEX(Objednavka!A:I,260,8)","v":0},null,{"$f":"IF(INDEX(Objednavka!A:J,260,10)=\"\",\"\",INDEX(Objednavka!A:J,260,10))","v":""}]
[null,{"$f":"IF(INDEX(Objednavka!A:I,261,3)=\"\",INDEX(Objednavka!A:I,261,1),INDEX(Objednavka!A:I,261,3))","v":0},null,null,null,null,null,{"$f":"INDEX(Objednavka!A:I,261,4)","v":0},null,{"$f":"INDEX(Objednavka!A:I,261,5)","v":0},{"$f":"INDEX(Objednavka!A:I,261,7)","v":0},{"$f":"INDEX(Objednavka!A:I,261,8)","v":0},null,{"$f":"IF(INDEX(Objednavka!A:J,261,10)=\"\",\"\",INDEX(Objednavka!A:J,261,10))","v":""}]
[null,{"$f":"IF(INDEX(Objednavka!A:I,262,3)=\"\",INDEX(Objednavka!A:I,262,1),INDEX(Objednavka!A:I,262,3))","v":0},null,null,null,null,null,{"$f":"INDEX(Objednavka!A:I,262,4)","v":0},null,{"$f":"INDEX(Objednavka!A:I,262,5)","v":0},{"$f":"INDEX(Objednavka!A:I,262,7)","v":0},{"$f":"INDEX(Objednavka!A:I,262,8)","v":0},null,{"$f":"IF(INDEX(Objednavka!A:J,262,10)=\"\",\"\",INDEX(Objednavka!A:J,262,10))","v":""}]
[null,{"$f":"IF(INDEX(Objednavka!A:I,263,3)=\"\",INDEX(Objednavka!A:I,263,1),INDEX(Objednavka!A:I,263,3))","v":0},null,null,null,null,null,{"$f":"INDEX(Objednavka!A:I,263,4)","v":0},null,{"$f":"INDEX(Objednavka!A:I,263,5)","v":0},{"$f":"INDEX(Objednavka!A:I,263,7)","v":0},{"$f":"INDEX(Objednavka!A:I,263,8)","v":0},null,{"$f":"IF(INDEX(Objednavka!A:J,263,10)=\"\",\"\",INDEX(Objednavka!A:J,263,10))","v":""}]
[null,{"$f":"IF(INDEX(Objednavka!A:I,264,3)=\"\",INDEX(Objednavka!A:I,264,1),INDEX(Objednavka!A:I,264,3))","v":0},null,null,null,null,null,{"$f":"INDEX(Objednavka!A:I,264,4)","v":0},null,{"$f":"INDEX(Objednavka!A:I,264,5)","v":0},{"$f":"INDEX(Objednavka!A:I,264,7)","v":0},{"$f":"INDEX(Objednavka!A:I,264,8)","v":0},null,{"$f":"IF(INDEX(Objednavka!A:J,264,10)=\"\",\"\",INDEX(Objednavka!A:J,264,10))","v":""}]
[null,{"$f":"IF(INDEX(Objednavka!A:I,265,3)=\"\",INDEX(Objednavka!A:I,265,1),INDEX(Objednavka!A:I,265,3))","v":0},null,null,null,null,null,{"$f":"INDEX(Objednavka!A:I,265,4)","v":0},null,{"$f":"INDEX(Objednavka!A:I,265,5)","v":0},{"$f":"INDEX(Objednavka!A:I,265,7)","v":0},{"$f":"INDEX(Objednavka!A:I,265,8)","v":0},null,{"$f":"IF(INDEX(Objednavka!A:J,265,10)=\"\",\"\",INDEX(Objednavka!A:J,265,10))","v":""}]
[null,{"$f":"IF(INDEX(Objednavka!A:I,266,3)=\"\",INDEX(Objednavka!A:I,266,1),INDEX(Objednavka!A:I,266,3))","v":0},null,null,null,null,null,{"$f":"INDEX(Objednavka!A:I,266,4)","v":0},null,{"$f":"INDEX(Objednavka!A:I,266,5)","v":0},{"$f":"INDEX(Objednavka!A:I,266,7)","v":0},{"$f":"INDEX(Objednavka!A:I,266,8)","v":0},null,{"$f":"IF(INDEX(Objednavka!A:J,266,10)=\"\",\"\",INDEX(Objednavka!A:J,266,10))","v":""}]
[null,{"$f":"IF(INDEX(Objednavka!A:I,267,3)=\"\",INDEX(Objednavka!A:I,267,1),INDEX(Objednavka!A:I,267,3))","v":0},null,null,null,null,null,{"$f":"INDEX(Objednavka!A:I,267,4)","v":0},null,{"$f":"INDEX(Objednavka!A:I,267,5)","v":0},{"$f":"INDEX(Objednavka!A:I,267,7)","v":0},{"$f":"INDEX(Objednavka!A:I,267,8)","v":0},null,{"$f":"IF(INDEX(Objednavka!A:J,267,10)=\"\",\"\",INDEX(Objednavka!A:J,267,10))","v":""}]
[null,{"$f":"IF(INDEX(Objednavka!A:I,268,3)=\"\",INDEX(Objednavka!A:I,268,1),INDEX(Objednavka!A:I,268,3))","v":0},null,null,null,null,null,{"$f":"INDEX(Objednavka!A:I,268,4)","v":0},null,{"$f":"INDEX(Objednavka!A:I,268,5)","v":0},{"$f":"INDEX(Objednavka!A:I,268,7)","v":0},{"$f":"INDEX(Objednavka!A:I,268,8)","v":0},null,{"$f":"IF(INDEX(Objednavka!A:J,268,10)=\"\",\"\",INDEX(Objednavka!A:J,268,10))","v":""}]
[null,{"$f":"IF(INDEX(Objednavka!A:I,269,3)=\"\",INDEX(Objednavka!A:I,269,1),INDEX(Objednavka!A:I,269,3))","v":0},null,null,null,null,null,{"$f":"INDEX(Objednavka!A:I,269,4)","v":0},null,{"$f":"INDEX(Objednavka!A:I,269,5)","v":0},{"$f":"INDEX(Objednavka!A:I,269,7)","v":0},{"$f":"INDEX(Objednavka!A:I,269,8)","v":0},null,{"$f":"IF(INDEX(Objednavka!A:J,269,10)=\"\",\"\",INDEX(Objednavka!A:J,269,10))","v":""}]
[null,{"$f":"IF(INDEX(Objednavka!A:I,270,3)=\"\",INDEX(Objednavka!A:I,270,1),INDEX(Objednavka!A:I,270,3))","v":0},null,null,null,null,null,{"$f":"INDEX(Objednavka!A:I,270,4)","v":0},null,{"$f":"INDEX(Objednavka!A:I,270,5)","v":0},{"$f":"INDEX(Objednavka!A:I,270,7)","v":0},{"$f":"INDEX(Objednavka!A:I,270,8)","v":0},null,{"$f":"IF(INDEX(Objednavka!A:J,270,10)=\"\",\"\",INDEX(Objednavka!A:J,270,10))","v":""}]
[null,{"$f":"IF(INDEX(Objednavka!A:I,271,3)=\"\",INDEX(Objednavka!A:I,271,1),INDEX(Objednavka!A:I,271,3))","v":0},null,null,null,null,null,{"$f":"INDEX(Objednavka!A:I,271,4)","v":0},null,{"$f":"INDEX(Objednavka!A:I,271,5)","v":0},{"$f":"INDEX(Objednavka!A:I,271,7)","v":0},{"$f":"INDEX(Objednavka!A:I,271,8)","v":0},null,{"$f":"IF(INDEX(Objednavka!A:J,271,10)=\"\",\"\",INDEX(Objednavka!A:J,271,10))","v":""}]
[null,{"$f":"IF(INDEX(Objednavka!A:I,272,3)=\"\",INDEX(Objednavka!A:I,272,1),INDEX(Objednavka!A:I,272,3))","v":0},null,null,null,null,null,{"$f":"INDEX(Objednavka!A:I,272,4)","v":0},null,{"$f":"INDEX(Objednavka!A:I,272,5)","v":0},{"$f":"INDEX(Objednavka!A:I,272,7)","v":0},{"$f":"INDEX(Objednavka!A:I,272,8)","v":0},null,{"$f":"IF(INDEX(Objednavka!A:J,272,10)=\"\",\"\",INDEX(Objednavka!A:J,272,10))","v":""}]
[null,{"$f":"IF(INDEX(Objednavka!A:I,273,3)=\"\",INDEX(Objednavka!A:I,273,1),INDEX(Objednavka!A:I,273,3))","v":0},null,null,null,null,null,{"$f":"INDEX(Objednavka!A:I,273,4)","v":0},null,{"$f":"INDEX(Objednavka!A:I,273,5)","v":0},{"$f":"INDEX(Objednavka!A:I,273,7)","v":0},{"$f":"INDEX(Objednavka!A:I,273,8)","v":0},null,{"$f":"IF(INDEX(Objednavka!A:J,273,10)=\"\",\"\",INDEX(Objednavka!A:J,273,10))","v":""}]
[null,{"$f":"IF(INDEX(Objednavka!A:I,274,3)=\"\",INDEX(Objednavka!A:I,274,1),INDEX(Objednavka!A:I,274,3))","v":0},null,null,null,null,null,{"$f":"INDEX(Objednavka!A:I,274,4)","v":0},null,{"$f":"INDEX(Objednavka!A:I,274,5)","v":0},{"$f":"INDEX(Objednavka!A:I,274,7)","v":0},{"$f":"INDEX(Objednavka!A:I,274,8)","v":0},null,{"$f":"IF(INDEX(Objednavka!A:J,274,10)=\"\",\"\",INDEX(Objednavka!A:J,274,10))","v":""}]
[null,{"$f":"IF(INDEX(Objednavka!A:I,275,3)=\"\",INDEX(Objednavka!A:I,275,1),INDEX(Objednavka!A:I,275,3))","v":0},null,null,null,null,null,{"$f":"INDEX(Objednavka!A:I,275,4)","v":0},null,{"$f":"INDEX(Objednavka!A:I,275,5)","v":0},{"$f":"INDEX(Objednavka!A:I,275,7)","v":0},{"$f":"INDEX(Objednavka!A:I,275,8)","v":0},null,{"$f":"IF(INDEX(Objednavka!A:J,275,10)=\"\",\"\",INDEX(Objednavka!A:J,275,10))","v":""}]
[null,{"$f":"IF(INDEX(Objednavka!A:I,276,3)=\"\",INDEX(Objednavka!A:I,276,1),INDEX(Objednavka!A:I,276,3))","v":0},null,null,null,null,null,{"$f":"INDEX(Objednavka!A:I,276,4)","v":0},null,{"$f":"INDEX(Objednavka!A:I,276,5)","v":0},{"$f":"INDEX(Objednavka!A:I,276,7)","v":0},{"$f":"INDEX(Objednavka!A:I,276,8)","v":0},null,{"$f":"IF(INDEX(Objednavka!A:J,276,10)=\"\",\"\",INDEX(Objednavka!A:J,276,10))","v":""}]
[null,{"$f":"IF(INDEX(Objednavka!A:I,277,3)=\"\",INDEX(Objednavka!A:I,277,1),INDEX(Objednavka!A:I,277,3))","v":0},null,null,null,null,null,{"$f":"INDEX(Objednavka!A:I,277,4)","v":0},null,{"$f":"INDEX(Objednavka!A:I,277,5)","v":0},{"$f":"INDEX(Objednavka!A:I,277,7)","v":0},{"$f":"INDEX(Objednavka!A:I,277,8)","v":0},null,{"$f":"IF(INDEX(Objednavka!A:J,277,10)=\"\",\"\",INDEX(Objednavka!A:J,277,10))","v":""}]
[null,{"$f":"IF(INDEX(Objednavka!A:I,278,3)=\"\",INDEX(Objednavka!A:I,278,1),INDEX(Objednavka!A:I,278,3))","v":0},null,null,null,null,null,{"$f":"INDEX(Objednavka!A:I,278,4)","v":0},null,{"$f":"INDEX(Objednavka!A:I,278,5)","v":0},{"$f":"INDEX(Objednavka!A:I,278,7)","v":0},{"$f":"INDEX(Objednavka!A:I,278,8)","v":0},null,{"$f":"IF(INDEX(Objednavka!A:J,278,10)=\"\",\"\",INDEX(Objednavka!A:J,278,10))","v":""}]
[null,{"$f":"IF(INDEX(Objednavka!A:I,279,3)=\"\",INDEX(Objednavka!A:I,279,1),INDEX(Objednavka!A:I,279,3))","v":0},null,null,null,null,null,{"$f":"INDEX(Objednavka!A:I,279,4)","v":0},null,{"$f":"INDEX(Objednavka!A:I,279,5)","v":0},{"$f":"INDEX(Objednavka!A:I,279,7)","v":0},{"$f":"INDEX(Objednavka!A:I,279,8)","v":0},null,{"$f":"IF(INDEX(Objednavka!A:J,279,10)=\"\",\"\",INDEX(Objednavka!A:J,279,10))","v":""}]
[null,{"$f":"IF(INDEX(Objednavka!A:I,280,3)=\"\",INDEX(Objednavka!A:I,280,1),INDEX(Objednavka!A:I,280,3))","v":0},null,null,null,null,null,{"$f":"INDEX(Objednavka!A:I,280,4)","v":0},null,{"$f":"INDEX(Objednavka!A:I,280,5)","v":0},{"$f":"INDEX(Objednavka!A:I,280,7)","v":0},{"$f":"INDEX(Objednavka!A:I,280,8)","v":0},null,{"$f":"IF(INDEX(Objednavka!A:J,280,10)=\"\",\"\",INDEX(Objednavka!A:J,280,10))","v":""}]
[null,{"$f":"IF(INDEX(Objednavka!A:I,281,3)=\"\",INDEX(Objednavka!A:I,281,1),INDEX(Objednavka!A:I,281,3))","v":0},null,null,null,null,null,{"$f":"INDEX(Objednavka!A:I,281,4)","v":0},null,{"$f":"INDEX(Objednavka!A:I,281,5)","v":0},{"$f":"INDEX(Objednavka!A:I,281,7)","v":0},{"$f":"INDEX(Objednavka!A:I,281,8)","v":0},null,{"$f":"IF(INDEX(Objednavka!A:J,281,10)=\"\",\"\",INDEX(Objednavka!A:J,281,10))","v":""}]
[null,{"$f":"IF(INDEX(Objednavka!A:I,282,3)=\"\",INDEX(Objednavka!A:I,282,1),INDEX(Objednavka!A:I,282,3))","v":0},null,null,null,null,null,{"$f":"INDEX(Objednavka!A:I,282,4)","v":0},null,{"$f":"INDEX(Objednavka!A:I,282,5)","v":0},{"$f":"INDEX(Objednavka!A:I,282,7)","v":0},{"$f":"INDEX(Objednavka!A:I,282,8)","v":0},null,{"$f":"IF(INDEX(Objednavka!A:J,282,10)=\"\",\"\",INDEX(Objednavka!A:J,282,10))","v":""}]
[null,{"$f":"IF(INDEX(Objednavka!A:I,283,3)=\"\",INDEX(Objednavka!A:I,283,1),INDEX(Objednavka!A:I,283,3))","v":0},null,null,null,null,null,{"$f":"INDEX(Objednavka!A:I,283,4)","v":0},null,{"$f":"INDEX(Objednavka!A:I,283,5)","v":0},{"$f":"INDEX(Objednavka!A:I,283,7)","v":0},{"$f":"INDEX(Objednavka!A:I,283,8)","v":0},null,{"$f":"IF(INDEX(Objednavka!A:J,283,10)=\"\",\"\",INDEX(Objednavka!A:J,283,10))","v":""}]
[null,{"$f":"IF(INDEX(Objednavka!A:I,284,3)=\"\",INDEX(Objednavka!A:I,284,1),INDEX(Objednavka!A:I,284,3))","v":0},null,null,null,null,null,{"$f":"INDEX(Objednavka!A:I,284,4)","v":0},null,{"$f":"INDEX(Objednavka!A:I,284,5)","v":0},{"$f":"INDEX(Objednavka!A:I,284,7)","v":0},{"$f":"INDEX(Objednavka!A:I,284,8)","v":0},null,{"$f":"IF(INDEX(Objednavka!A:J,284,10)=\"\",\"\",INDEX(Objednavka!A:J,284,10))","v":""}]
[null,{"$f":"IF(INDEX(Objednavka!A:I,285,3)=\"\",INDEX(Objednavka!A:I,285,1),INDEX(Objednavka!A:I,285,3))","v":0},null,null,null,null,null,{"$f":"INDEX(Objednavka!A:I,285,4)","v":0},null,{"$f":"INDEX(Objednavka!A:I,285,5)","v":0},{"$f":"INDEX(Objednavka!A:I,285,7)","v":0},{"$f":"INDEX(Objednavka!A:I,285,8)","v":0},null,{"$f":"IF(INDEX(Objednavka!A:J,285,10)=\"\",\"\",INDEX(Objednavka!A:J,285,10))","v":""}]
[null,{"$f":"IF(INDEX(Objednavka!A:I,286,3)=\"\",INDEX(Objednavka!A:I,286,1),INDEX(Objednavka!A:I,286,3))","v":0},null,null,null,null,null,{"$f":"INDEX(Objednavka!A:I,286,4)","v":0},null,{"$f":"INDEX(Objednavka!A:I,286,5)","v":0},{"$f":"INDEX(Objednavka!A:I,286,7)","v":0},{"$f":"INDEX(Objednavka!A:I,286,8)","v":0},null,{"$f":"IF(INDEX(Objednavka!A:J,286,10)=\"\",\"\",INDEX(Objednavka!A:J,286,10))","v":""}]
[null,{"$f":"IF(INDEX(Objednavka!A:I,287,3)=\"\",INDEX(Objednavka!A:I,287,1),INDEX(Objednavka!A:I,287,3))","v":0},null,null,null,null,null,{"$f":"INDEX(Objednavka!A:I,287,4)","v":0},null,{"$f":"INDEX(Objednavka!A:I,287,5)","v":0},{"$f":"INDEX(Objednavka!A:I,287,7)","v":0},{"$f":"INDEX(Objednavka!A:I,287,8)","v":0},null,{"$f":"IF(INDEX(Objednavka!A:J,287,10)=\"\",\"\",INDEX(Objednavka!A:J,287,10))","v":""}]
[null,{"$f":"IF(INDEX(Objednavka!A:I,288,3)=\"\",INDEX(Objednavka!A:I,288,1),INDEX(Objednavka!A:I,288,3))","v":0},null,null,null,null,null,{"$f":"INDEX(Objednavka!A:I,288,4)","v":0},null,{"$f":"INDEX(Objednavka!A:I,288,5)","v":0},{"$f":"INDEX(Objednavka!A:I,288,7)","v":0},{"$f":"INDEX(Objednavka!A:I,288,8)","v":0},null,{"$f":"IF(INDEX(Objednavka!A:J,288,10)=\"\",\"\",INDEX(Objednavka!A:J,288,10))","v":""}]
[null,{"$f":"IF(INDEX(Objednavka!A:I,289,3)=\"\",INDEX(Objednavka!A:I,289,1),INDEX(Objednavka!A:I,289,3))","v":0},null,null,null,null,null,{"$f":"INDEX(Objednavka!A:I,289,4)","v":0},null,{"$f":"INDEX(Objednavka!A:I,289,5)","v":0},{"$f":"INDEX(Objednavka!A:I,289,7)","v":0},{"$f":"INDEX(Objednavka!A:I,289,8)","v":0},null,{"$f":"IF(INDEX(Objednavka!A:J,289,10)=\"\",\"\",INDEX(Objednavka!A:J,289,10))","v":""}]
[null,{"$f":"IF(INDEX(Objednavka!A:I,290,3)=\"\",INDEX(Objednavka!A:I,290,1),INDEX(Objednavka!A:I,290,3))","v":0},null,null,null,null,null,{"$f":"INDEX(Objednavka!A:I,290,4)","v":0},null,{"$f":"INDEX(Objednavka!A:I,290,5)","v":0},{"$f":"INDEX(Objednavka!A:I,290,7)","v":0},{"$f":"INDEX(Objednavka!A:I,290,8)","v":0},null,{"$f":"IF(INDEX(Objednavka!A:J,290,10)=\"\",\"\",INDEX(Objednavka!A:J,290,10))","v":""}]
[null,{"$f":"IF(INDEX(Objednavka!A:I,291,3)=\"\",INDEX(Objednavka!A:I,291,1),INDEX(Objednavka!A:I,291,3))","v":0},null,null,null,null,null,{"$f":"INDEX(Objednavka!A:I,291,4)","v":0},null,{"$f":"INDEX(Objednavka!A:I,291,5)","v":0},{"$f":"INDEX(Objednavka!A:I,291,7)","v":0},{"$f":"INDEX(Objednavka!A:I,291,8)","v":0},null,{"$f":"IF(INDEX(Objednavka!A:J,291,10)=\"\",\"\",INDEX(Objednavka!A:J,291,10))","v":""}]
[null,{"$f":"IF(INDEX(Objednavka!A:I,292,3)=\"\",INDEX(Objednavka!A:I,292,1),INDEX(Objednavka!A:I,292,3))","v":0},null,null,null,null,null,{"$f":"INDEX(Objednavka!A:I,292,4)","v":0},null,{"$f":"INDEX(Objednavka!A:I,292,5)","v":0},{"$f":"INDEX(Objednavka!A:I,292,7)","v":0},{"$f":"INDEX(Objednavka!A:I,292,8)","v":0},null,{"$f":"IF(INDEX(Objednavka!A:J,292,10)=\"\",\"\",INDEX(Objednavka!A:J,292,10))","v":""}]
[null,{"$f":"IF(INDEX(Objednavka!A:I,293,3)=\"\",INDEX(Objednavka!A:I,293,1),INDEX(Objednavka!A:I,293,3))","v":0},null,null,null,null,null,{"$f":"INDEX(Objednavka!A:I,293,4)","v":0},null,{"$f":"INDEX(Objednavka!A:I,293,5)","v":0},{"$f":"INDEX(Objednavka!A:I,293,7)","v":0},{"$f":"INDEX(Objednavka!A:I,293,8)","v":0},null,{"$f":"IF(INDEX(Objednavka!A:J,293,10)=\"\",\"\",INDEX(Objednavka!A:J,293,10))","v":""}]
[null,{"$f":"IF(INDEX(Objednavka!A:I,294,3)=\"\",INDEX(Objednavka!A:I,294,1),INDEX(Objednavka!A:I,294,3))","v":0},null,null,null,null,null,{"$f":"INDEX(Objednavka!A:I,294,4)","v":0},null,{"$f":"INDEX(Objednavka!A:I,294,5)","v":0},{"$f":"INDEX(Objednavka!A:I,294,7)","v":0},{"$f":"INDEX(Objednavka!A:I,294,8)","v":0},null,{"$f":"IF(INDEX(Objednavka!A:J,294,10)=\"\",\"\",INDEX(Objednavka!A:J,294,10))","v":""}]
[null,{"$f":"IF(INDEX(Objednavka!A:I,295,3)=\"\",INDEX(Objednavka!A:I,295,1),INDEX(Objednavka!A:I,295,3))","v":0},null,null,null,null,null,{"$f":"INDEX(Objednavka!A:I,295,4)","v":0},null,{"$f":"INDEX(Objednavka!A:I,295,5)","v":0},{"$f":"INDEX(Objednavka!A:I,295,7)","v":0},{"$f":"INDEX(Objednavka!A:I,295,8)","v":0},null,{"$f":"IF(INDEX(Objednavka!A:J,295,10)=\"\",\"\",INDEX(Objednavka!A:J,295,10))","v":""}]
[null,{"$f":"IF(INDEX(Objednavka!A:I,296,3)=\"\",INDEX(Objednavka!A:I,296,1),INDEX(Objednavka!A:I,296,3))","v":0},null,null,null,null,null,{"$f":"INDEX(Objednavka!A:I,296,4)","v":0},null,{"$f":"INDEX(Objednavka!A:I,296,5)","v":0},{"$f":"INDEX(Objednavka!A:I,296,7)","v":0},{"$f":"INDEX(Objednavka!A:I,296,8)","v":0},null,{"$f":"IF(INDEX(Objednavka!A:J,296,10)=\"\",\"\",INDEX(Objednavka!A:J,296,10))","v":""}]
[null,{"$f":"IF(INDEX(Objednavka!A:I,297,3)=\"\",INDEX(Objednavka!A:I,297,1),INDEX(Objednavka!A:I,297,3))","v":0},null,null,null,null,null,{"$f":"INDEX(Objednavka!A:I,297,4)","v":0},null,{"$f":"INDEX(Objednavka!A:I,297,5)","v":0},{"$f":"INDEX(Objednavka!A:I,297,7)","v":0},{"$f":"INDEX(Objednavka!A:I,297,8)","v":0},null,{"$f":"IF(INDEX(Objednavka!A:J,297,10)=\"\",\"\",INDEX(Objednavka!A:J,297,10))","v":""}]
[null,{"$f":"IF(INDEX(Objednavka!A:I,298,3)=\"\",INDEX(Objednavka!A:I,298,1),INDEX(Objednavka!A:I,298,3))","v":0},null,null,null,null,null,{"$f":"INDEX(Objednavka!A:I,298,4)","v":0},null,{"$f":"INDEX(Objednavka!A:I,298,5)","v":0},{"$f":"INDEX(Objednavka!A:I,298,7)","v":0},{"$f":"INDEX(Objednavka!A:I,298,8)","v":0},null,{"$f":"IF(INDEX(Objednavka!A:J,298,10)=\"\",\"\",INDEX(Objednavka!A:J,298,10))","v":""}]
[null,{"$f":"IF(INDEX(Objednavka!A:I,299,3)=\"\",INDEX(Objednavka!A:I,299,1),INDEX(Objednavka!A:I,299,3))","v":0},null,null,null,null,null,{"$f":"INDEX(Objednavka!A:I,299,4)","v":0},null,{"$f":"INDEX(Objednavka!A:I,299,5)","v":0},{"$f":"INDEX(Objednavka!A:I,299,7)","v":0},{"$f":"INDEX(Objednavka!A:I,299,8)","v":0},null,{"$f":"IF(INDEX(Objednavka!A:J,299,10)=\"\",\"\",INDEX(Objednavka!A:J,299,10))","v":""}]
[null,{"$f":"IF(INDEX(Objednavka!A:I,300,3)=\"\",INDEX(Objednavka!A:I,300,1),INDEX(Objednavka!A:I,300,3))","v":0},null,null,null,null,null,{"$f":"INDEX(Objednavka!A:I,300,4)","v":0},null,{"$f":"INDEX(Objednavka!A:I,300,5)","v":0},{"$f":"INDEX(Objednavka!A:I,300,7)","v":0},{"$f":"INDEX(Objednavka!A:I,300,8)","v":0},null,{"$f":"IF(INDEX(Objednavka!A:J,300,10)=\"\",\"\",INDEX(Objednavka!A:J,300,10))","v":""}]
[null,{"$f":"IF(INDEX(Objednavka!A:I,301,3)=\"\",INDEX(Objednavka!A:I,301,1),INDEX(Objednavka!A:I,301,3))","v":0},null,null,null,null,null,{"$f":"INDEX(Objednavka!A:I,301,4)","v":0},null,{"$f":"INDEX(Objednavka!A:I,301,5)","v":0},{"$f":"INDEX(Objednavka!A:I,301,7)","v":0},{"$f":"INDEX(Objednavka!A:I,301,8)","v":0},null,{"$f":"IF(INDEX(Objednavka!A:J,301,10)=\"\",\"\",INDEX(Objednavka!A:J,301,10))","v":""}]
[null,{"$f":"IF(INDEX(Objednavka!A:I,302,3)=\"\",INDEX(Objednavka!A:I,302,1),INDEX(Objednavka!A:I,302,3))","v":0},null,null,null,null,null,{"$f":"INDEX(Objednavka!A:I,302,4)","v":0},null,{"$f":"INDEX(Objednavka!A:I,302,5)","v":0},{"$f":"INDEX(Objednavka!A:I,302,7)","v":0},{"$f":"INDEX(Objednavka!A:I,302,8)","v":0},null,{"$f":"IF(INDEX(Objednavka!A:J,302,10)=\"\",\"\",INDEX(Objednavka!A:J,302,10))","v":""}]
[null,{"$f":"IF(INDEX(Objednavka!A:I,303,3)=\"\",INDEX(Objednavka!A:I,303,1),INDEX(Objednavka!A:I,303,3))","v":0},null,null,null,null,null,{"$f":"INDEX(Objednavka!A:I,303,4)","v":0},null,{"$f":"INDEX(Objednavka!A:I,303,5)","v":0},{"$f":"INDEX(Objednavka!A:I,303,7)","v":0},{"$f":"INDEX(Objednavka!A:I,303,8)","v":0},null,{"$f":"IF(INDEX(Objednavka!A:J,303,10)=\"\",\"\",INDEX(Objednavka!A:J,303,10))","v":""}]
[null,{"$f":"IF(INDEX(Objednavka!A:I,304,3)=\"\",INDEX(Objednavka!A:I,304,1),INDEX(Objednavka!A:I,304,3))","v":0},null,null,null,null,null,{"$f":"INDEX(Objednavka!A:I,304,4)","v":0},null,{"$f":"INDEX(Objednavka!A:I,304,5)","v":0},{"$f":"INDEX(Objednavka!A:I,304,7)","v":0},{"$f":"INDEX(Objednavka!A:I,304,8)","v":0},null,{"$f":"IF(INDEX(Objednavka!A:J,304,10)=\"\",\"\",INDEX(Objednavka!A:J,304,10))","v":""}]
[null,{"$f":"IF(INDEX(Objednavka!A:I,305,3)=\"\",INDEX(Objednavka!A:I,305,1),INDEX(Objednavka!A:I,305,3))","v":0},null,null,null,null,null,{"$f":"INDEX(Objednavka!A:I,305,4)","v":0},null,{"$f":"INDEX(Objednavka!A:I,305,5)","v":0},{"$f":"INDEX(Objednavka!A:I,305,7)","v":0},{"$f":"INDEX(Objednavka!A:I,305,8)","v":0},null,{"$f":"IF(INDEX(Objednavka!A:J,305,10)=\"\",\"\",INDEX(Objednavka!A:J,305,10))","v":""}]
[null,{"$f":"IF(INDEX(Objednavka!A:I,306,3)=\"\",INDEX(Objednavka!A:I,306,1),INDEX(Objednavka!A:I,306,3))","v":0},null,null,null,null,null,{"$f":"INDEX(Objednavka!A:I,306,4)","v":0},null,{"$f":"INDEX(Objednavka!A:I,306,5)","v":0},{"$f":"INDEX(Objednavka!A:I,306,7)","v":0},{"$f":"INDEX(Objednavka!A:I,306,8)","v":0},null,{"$f":"IF(INDEX(Objednavka!A:J,306,10)=\"\",\"\",INDEX(Objednavka!A:J,306,10))","v":""}]
[null,{"$f":"IF(INDEX(Objednavka!A:I,307,3)=\"\",INDEX(Objednavka!A:I,307,1),INDEX(Objednavka!A:I,307,3))","v":0},null,null,null,null,null,{"$f":"INDEX(Objednavka!A:I,307,4)","v":0},null,{"$f":"INDEX(Objednavka!A:I,307,5)","v":0},{"$f":"INDEX(Objednavka!A:I,307,7)","v":0},{"$f":"INDEX(Objednavka!A:I,307,8)","v":0},null,{"$f":"IF(INDEX(Objednavka!A:J,307,10)=\"\",\"\",INDEX(Objednavka!A:J,307,10))","v":""}]
[null,{"$f":"IF(INDEX(Objednavka!A:I,308,3)=\"\",INDEX(Objednavka!A:I,308,1),INDEX(Objednavka!A:I,308,3))","v":0},null,null,null,null,null,{"$f":"INDEX(Objednavka!A:I,308,4)","v":0},null,{"$f":"INDEX(Objednavka!A:I,308,5)","v":0},{"$f":"INDEX(Objednavka!A:I,308,7)","v":0},{"$f":"INDEX(Objednavka!A:I,308,8)","v":0},null,{"$f":"IF(INDEX(Objednavka!A:J,308,10)=\"\",\"\",INDEX(Objednavka!A:J,308,10))","v":""}]
[null,{"$f":"IF(INDEX(Objednavka!A:I,309,3)=\"\",INDEX(Objednavka!A:I,309,1),INDEX(Objednavka!A:I,309,3))","v":0},null,null,null,null,null,{"$f":"INDEX(Objednavka!A:I,309,4)","v":0},null,{"$f":"INDEX(Objednavka!A:I,309,5)","v":0},{"$f":"INDEX(Objednavka!A:I,309,7)","v":0},{"$f":"INDEX(Objednavka!A:I,309,8)","v":0},null,{"$f":"IF(INDEX(Objednavka!A:J,309,10)=\"\",\"\",INDEX(Objednavka!A:J,309,10))","v":""}]
[null,{"$f":"IF(INDEX(Objednavka!A:I,310,3)=\"\",INDEX(Objednavka!A:I,310,1),INDEX(Objednavka!A:I,310,3))","v":0},null,null,null,null,null,{"$f":"INDEX(Objednavka!A:I,310,4)","v":0},null,{"$f":"INDEX(Objednavka!A:I,310,5)","v":0},{"$f":"INDEX(Objednavka!A:I,310,7)","v":0},{"$f":"INDEX(Objednavka!A:I,310,8)","v":0},null,{"$f":"IF(INDEX(Objednavka!A:J,310,10)=\"\",\"\",INDEX(Objednavka!A:J,310,10))","v":""}]
[null,{"$f":"IF(INDEX(Objednavka!A:I,311,3)=\"\",INDEX(Objednavka!A:I,311,1),INDEX(Objednavka!A:I,311,3))","v":0},null,null,null,null,null,{"$f":"INDEX(Objednavka!A:I,311,4)","v":0},null,{"$f":"INDEX(Objednavka!A:I,311,5)","v":0},{"$f":"INDEX(Objednavka!A:I,311,7)","v":0},{"$f":"INDEX(Objednavka!A:I,311,8)","v":0},null,{"$f":"IF(INDEX(Objednavka!A:J,311,10)=\"\",\"\",INDEX(Objednavka!A:J,311,10))","v":""}]
[null,{"$f":"IF(INDEX(Objednavka!A:I,312,3)=\"\",INDEX(Objednavka!A:I,312,1),INDEX(Objednavka!A:I,312,3))","v":0},null,null,null,null,null,{"$f":"INDEX(Objednavka!A:I,312,4)","v":0},null,{"$f":"INDEX(Objednavka!A:I,312,5)","v":0},{"$f":"INDEX(Objednavka!A:I,312,7)","v":0},{"$f":"INDEX(Objednavka!A:I,312,8)","v":0},null,{"$f":"IF(INDEX(Objednavka!A:J,312,10)=\"\",\"\",INDEX(Objednavka!A:J,312,10))","v":""}]
[null,{"$f":"IF(INDEX(Objednavka!A:I,313,3)=\"\",INDEX(Objednavka!A:I,313,1),INDEX(Objednavka!A:I,313,3))","v":0},null,null,null,null,null,{"$f":"INDEX(Objednavka!A:I,313,4)","v":0},null,{"$f":"INDEX(Objednavka!A:I,313,5)","v":0},{"$f":"INDEX(Objednavka!A:I,313,7)","v":0},{"$f":"INDEX(Objednavka!A:I,313,8)","v":0},null,{"$f":"IF(INDEX(Objednavka!A:J,313,10)=\"\",\"\",INDEX(Objednavka!A:J,313,10))","v":""}]
[null,{"$f":"IF(INDEX(Objednavka!A:I,314,3)=\"\",INDEX(Objednavka!A:I,314,1),INDEX(Objednavka!A:I,314,3))","v":0},null,null,null,null,null,{"$f":"INDEX(Objednavka!A:I,314,4)","v":0},null,{"$f":"INDEX(Objednavka!A:I,314,5)","v":0},{"$f":"INDEX(Objednavka!A:I,314,7)","v":0},{"$f":"INDEX(Objednavka!A:I,314,8)","v":0},null,{"$f":"IF(INDEX(Objednavka!A:J,314,10)=\"\",\"\",INDEX(Objednavka!A:J,314,10))","v":""}]
[null,{"$f":"IF(INDEX(Objednavka!A:I,315,3)=\"\",INDEX(Objednavka!A:I,315,1),INDEX(Objednavka!A:I,315,3))","v":0},null,null,null,null,null,{"$f":"INDEX(Objednavka!A:I,315,4)","v":0},null,{"$f":"INDEX(Objednavka!A:I,315,5)","v":0},{"$f":"INDEX(Objednavka!A:I,315,7)","v":0},{"$f":"INDEX(Objednavka!A:I,315,8)","v":0},null,{"$f":"IF(INDEX(Objednavka!A:J,315,10)=\"\",\"\",INDEX(Objednavka!A:J,315,10))","v":""}]
[null,{"$f":"IF(INDEX(Objednavka!A:I,316,3)=\"\",INDEX(Objednavka!A:I,316,1),INDEX(Objednavka!A:I,316,3))","v":0},null,null,null,null,null,{"$f":"INDEX(Objednavka!A:I,316,4)","v":0},null,{"$f":"INDEX(Objednavka!A:I,316,5)","v":0},{"$f":"INDEX(Objednavka!A:I,316,7)","v":0},{"$f":"INDEX(Objednavka!A:I,316,8)","v":0},null,{"$f":"IF(INDEX(Objednavka!A:J,316,10)=\"\",\"\",INDEX(Objednavka!A:J,316,10))","v":""}]
[null,{"$f":"IF(INDEX(Objednavka!A:I,317,3)=\"\",INDEX(Objednavka!A:I,317,1),INDEX(Objednavka!A:I,317,3))","v":0},null,null,null,null,null,{"$f":"INDEX(Objednavka!A:I,317,4)","v":0},null,{"$f":"INDEX(Objednavka!A:I,317,5)","v":0},{"$f":"INDEX(Objednavka!A:I,317,7)","v":0},{"$f":"INDEX(Objednavka!A:I,317,8)","v":0},null,{"$f":"IF(INDEX(Objednavka!A:J,317,10)=\"\",\"\",INDEX(Objednavka!A:J,317,10))","v":""}]
[null,{"$f":"IF(INDEX(Objednavka!A:I,318,3)=\"\",INDEX(Objednavka!A:I,318,1),INDEX(Objednavka!A:I,318,3))","v":0},null,null,null,null,null,{"$f":"INDEX(Objednavka!A:I,318,4)","v":0},null,{"$f":"INDEX(Objednavka!A:I,318,5)","v":0},{"$f":"INDEX(Objednavka!A:I,318,7)","v":0},{"$f":"INDEX(Objednavka!A:I,318,8)","v":0},null,{"$f":"IF(INDEX(Objednavka!A:J,318,10)=\"\",\"\",INDEX(Objednavka!A:J,318,10))","v":""}]
[null,{"$f":"IF(INDEX(Objednavka!A:I,319,3)=\"\",INDEX(Objednavka!A:I,319,1),INDEX(Objednavka!A:I,319,3))","v":0},null,null,null,null,null,{"$f":"INDEX(Objednavka!A:I,319,4)","v":0},null,{"$f":"INDEX(Objednavka!A:I,319,5)","v":0},{"$f":"INDEX(Objednavka!A:I,319,7)","v":0},{"$f":"INDEX(Objednavka!A:I,319,8)","v":0},null,{"$f":"IF(INDEX(Objednavka!A:J,319,10)=\"\",\"\",INDEX(Objednavka!A:J,319,10))","v":""}]
[null,{"$f":"IF(INDEX(Objednavka!A:I,320,3)=\"\",INDEX(Objednavka!A:I,320,1),INDEX(Objednavka!A:I,320,3))","v":0},null,null,null,null,null,{"$f":"INDEX(Objednavka!A:I,320,4)","v":0},null,{"$f":"INDEX(Objednavka!A:I,320,5)","v":0},{"$f":"INDEX(Objednavka!A:I,320,7)","v":0},{"$f":"INDEX(Objednavka!A:I,320,8)","v":0},null,{"$f":"IF(INDEX(Objednavka!A:J,320,10)=\"\",\"\",INDEX(Objednavka!A:J,320,10))","v":""}]
[null,{"$f":"IF(INDEX(Objednavka!A:I,321,3)=\"\",INDEX(Objednavka!A:I,321,1),INDEX(Objednavka!A:I,321,3))","v":0},null,null,null,null,null,{"$f":"INDEX(Objednavka!A:I,321,4)","v":0},null,{"$f":"INDEX(Objednavka!A:I,321,5)","v":0},{"$f":"INDEX(Objednavka!A:I,321,7)","v":0},{"$f":"INDEX(Objednavka!A:I,321,8)","v":0},null,{"$f":"IF(INDEX(Objednavka!A:J,321,10)=\"\",\"\",INDEX(Objednavka!A:J,321,10))","v":""}]
[null,{"$f":"IF(INDEX(Objednavka!A:I,322,3)=\"\",INDEX(Objednavka!A:I,322,1),INDEX(Objednavka!A:I,322,3))","v":0},null,null,null,null,null,{"$f":"INDEX(Objednavka!A:I,322,4)","v":0},null,{"$f":"INDEX(Objednavka!A:I,322,5)","v":0},{"$f":"INDEX(Objednavka!A:I,322,7)","v":0},{"$f":"INDEX(Objednavka!A:I,322,8)","v":0},null,{"$f":"IF(INDEX(Objednavka!A:J,322,10)=\"\",\"\",INDEX(Objednavka!A:J,322,10))","v":""}]
[null,{"$f":"IF(INDEX(Objednavka!A:I,323,3)=\"\",INDEX(Objednavka!A:I,323,1),INDEX(Objednavka!A:I,323,3))","v":0},null,null,null,null,null,{"$f":"INDEX(Objednavka!A:I,323,4)","v":0},null,{"$f":"INDEX(Objednavka!A:I,323,5)","v":0},{"$f":"INDEX(Objednavka!A:I,323,7)","v":0},{"$f":"INDEX(Objednavka!A:I,323,8)","v":0},null,{"$f":"IF(INDEX(Objednavka!A:J,323,10)=\"\",\"\",INDEX(Objednavka!A:J,323,10))","v":""}]
[null,{"$f":"IF(INDEX(Objednavka!A:I,324,3)=\"\",INDEX(Objednavka!A:I,324,1),INDEX(Objednavka!A:I,324,3))","v":0},null,null,null,null,null,{"$f":"INDEX(Objednavka!A:I,324,4)","v":0},null,{"$f":"INDEX(Objednavka!A:I,324,5)","v":0},{"$f":"INDEX(Objednavka!A:I,324,7)","v":0},{"$f":"INDEX(Objednavka!A:I,324,8)","v":0},null,{"$f":"IF(INDEX(Objednavka!A:J,324,10)=\"\",\"\",INDEX(Objednavka!A:J,324,10))","v":""}]
[null,{"$f":"IF(INDEX(Objednavka!A:I,325,3)=\"\",INDEX(Objednavka!A:I,325,1),INDEX(Objednavka!A:I,325,3))","v":0},null,null,null,null,null,{"$f":"INDEX(Objednavka!A:I,325,4)","v":0},null,{"$f":"INDEX(Objednavka!A:I,325,5)","v":0},{"$f":"INDEX(Objednavka!A:I,325,7)","v":0},{"$f":"INDEX(Objednavka!A:I,325,8)","v":0},null,{"$f":"IF(INDEX(Objednavka!A:J,325,10)=\"\",\"\",INDEX(Objednavka!A:J,325,10))","v":""}]
[null,{"$f":"IF(INDEX(Objednavka!A:I,326,3)=\"\",INDEX(Objednavka!A:I,326,1),INDEX(Objednavka!A:I,326,3))","v":0},null,null,null,null,null,{"$f":"INDEX(Objednavka!A:I,326,4)","v":0},null,{"$f":"INDEX(Objednavka!A:I,326,5)","v":0},{"$f":"INDEX(Objednavka!A:I,326,7)","v":0},{"$f":"INDEX(Objednavka!A:I,326,8)","v":0},null,{"$f":"IF(INDEX(Objednavka!A:J,326,10)=\"\",\"\",INDEX(Objednavka!A:J,326,10))","v":""}]
[null,{"$f":"IF(INDEX(Objednavka!A:I,327,3)=\"\",INDEX(Objednavka!A:I,327,1),INDEX(Objednavka!A:I,327,3))","v":0},null,null,null,null,null,{"$f":"INDEX(Objednavka!A:I,327,4)","v":0},null,{"$f":"INDEX(Objednavka!A:I,327,5)","v":0},{"$f":"INDEX(Objednavka!A:I,327,7)","v":0},{"$f":"INDEX(Objednavka!A:I,327,8)","v":0},null,{"$f":"IF(INDEX(Objednavka!A:J,327,10)=\"\",\"\",INDEX(Objednavka!A:J,327,10))","v":""}]
[null,{"$f":"IF(INDEX(Objednavka!A:I,328,3)=\"\",INDEX(Objednavka!A:I,328,1),INDEX(Objednavka!A:I,328,3))","v":0},null,null,null,null,null,{"$f":"INDEX(Objednavka!A:I,328,4)","v":0},null,{"$f":"INDEX(Objednavka!A:I,328,5)","v":0},{"$f":"INDEX(Objednavka!A:I,328,7)","v":0},{"$f":"INDEX(Objednavka!A:I,328,8)","v":0},null,{"$f":"IF(INDEX(Objednavka!A:J,328,10)=\"\",\"\",INDEX(Objednavka!A:J,328,10))","v":""}]
[null,{"$f":"IF(INDEX(Objednavka!A:I,329,3)=\"\",INDEX(Objednavka!A:I,329,1),INDEX(Objednavka!A:I,329,3))","v":0},null,null,null,null,null,{"$f":"INDEX(Objednavka!A:I,329,4)","v":0},null,{"$f":"INDEX(Objednavka!A:I,329,5)","v":0},{"$f":"INDEX(Objednavka!A:I,329,7)","v":0},{"$f":"INDEX(Objednavka!A:I,329,8)","v":0},null,{"$f":"IF(INDEX(Objednavka!A:J,329,10)=\"\",\"\",INDEX(Objednavka!A:J,329,10))","v":""}]
[null,{"$f":"IF(INDEX(Objednavka!A:I,330,3)=\"\",INDEX(Objednavka!A:I,330,1),INDEX(Objednavka!A:I,330,3))","v":0},null,null,null,null,null,{"$f":"INDEX(Objednavka!A:I,330,4)","v":0},null,{"$f":"INDEX(Objednavka!A:I,330,5)","v":0},{"$f":"INDEX(Objednavka!A:I,330,7)","v":0},{"$f":"INDEX(Objednavka!A:I,330,8)","v":0},null,{"$f":"IF(INDEX(Objednavka!A:J,330,10)=\"\",\"\",INDEX(Objednavka!A:J,330,10))","v":""}]
[null,{"$f":"IF(INDEX(Objednavka!A:I,331,3)=\"\",INDEX(Objednavka!A:I,331,1),INDEX(Objednavka!A:I,331,3))","v":0},null,null,null,null,null,{"$f":"INDEX(Objednavka!A:I,331,4)","v":0},null,{"$f":"INDEX(Objednavka!A:I,331,5)","v":0},{"$f":"INDEX(Objednavka!A:I,331,7)","v":0},{"$f":"INDEX(Objednavka!A:I,331,8)","v":0},null,{"$f":"IF(INDEX(Objednavka!A:J,331,10)=\"\",\"\",INDEX(Objednavka!A:J,331,10))","v":""}]
[null,{"$f":"IF(INDEX(Objednavka!A:I,332,3)=\"\",INDEX(Objednavka!A:I,332,1),INDEX(Objednavka!A:I,332,3))","v":0},null,null,null,null,null,{"$f":"INDEX(Objednavka!A:I,332,4)","v":0},null,{"$f":"INDEX(Objednavka!A:I,332,5)","v":0},{"$f":"INDEX(Objednavka!A:I,332,7)","v":0},{"$f":"INDEX(Objednavka!A:I,332,8)","v":0},null,{"$f":"IF(INDEX(Objednavka!A:J,332,10)=\"\",\"\",INDEX(Objednavka!A:J,332,10))","v":""}]
[null,{"$f":"IF(INDEX(Objednavka!A:I,333,3)=\"\",INDEX(Objednavka!A:I,333,1),INDEX(Objednavka!A:I,333,3))","v":0},null,null,null,null,null,{"$f":"INDEX(Objednavka!A:I,333,4)","v":0},null,{"$f":"INDEX(Objednavka!A:I,333,5)","v":0},{"$f":"INDEX(Objednavka!A:I,333,7)","v":0},{"$f":"INDEX(Objednavka!A:I,333,8)","v":0},null,{"$f":"IF(INDEX(Objednavka!A:J,333,10)=\"\",\"\",INDEX(Objednavka!A:J,333,10))","v":""}]
[null,{"$f":"IF(INDEX(Objednavka!A:I,334,3)=\"\",INDEX(Objednavka!A:I,334,1),INDEX(Objednavka!A:I,334,3))","v":0},null,null,null,null,null,{"$f":"INDEX(Objednavka!A:I,334,4)","v":0},null,{"$f":"INDEX(Objednavka!A:I,334,5)","v":0},{"$f":"INDEX(Objednavka!A:I,334,7)","v":0},{"$f":"INDEX(Objednavka!A:I,334,8)","v":0},null,{"$f":"IF(INDEX(Objednavka!A:J,334,10)=\"\",\"\",INDEX(Objednavka!A:J,334,10))","v":""}]
[null,{"$f":"IF(INDEX(Objednavka!A:I,335,3)=\"\",INDEX(Objednavka!A:I,335,1),INDEX(Objednavka!A:I,335,3))","v":0},null,null,null,null,null,{"$f":"INDEX(Objednavka!A:I,335,4)","v":0},null,{"$f":"INDEX(Objednavka!A:I,335,5)","v":0},{"$f":"INDEX(Objednavka!A:I,335,7)","v":0},{"$f":"INDEX(Objednavka!A:I,335,8)","v":0},null,{"$f":"IF(INDEX(Objednavka!A:J,335,10)=\"\",\"\",INDEX(Objednavka!A:J,335,10))","v":""}]
[null,{"$f":"IF(INDEX(Objednavka!A:I,336,3)=\"\",INDEX(Objednavka!A:I,336,1),INDEX(Objednavka!A:I,336,3))","v":0},null,null,null,null,null,{"$f":"INDEX(Objednavka!A:I,336,4)","v":0},null,{"$f":"INDEX(Objednavka!A:I,336,5)","v":0},{"$f":"INDEX(Objednavka!A:I,336,7)","v":0},{"$f":"INDEX(Objednavka!A:I,336,8)","v":0},null,{"$f":"IF(INDEX(Objednavka!A:J,336,10)=\"\",\"\",INDEX(Objednavka!A:J,336,10))","v":""}]
[null,{"$f":"IF(INDEX(Objednavka!A:I,337,3)=\"\",INDEX(Objednavka!A:I,337,1),INDEX(Objednavka!A:I,337,3))","v":0},null,null,null,null,null,{"$f":"INDEX(Objednavka!A:I,337,4)","v":0},null,{"$f":"INDEX(Objednavka!A:I,337,5)","v":0},{"$f":"INDEX(Objednavka!A:I,337,7)","v":0},{"$f":"INDEX(Objednavka!A:I,337,8)","v":0},null,{"$f":"IF(INDEX(Objednavka!A:J,337,10)=\"\",\"\",INDEX(Objednavka!A:J,337,10))","v":""}]
[null,{"$f":"IF(INDEX(Objednavka!A:I,338,3)=\"\",INDEX(Objednavka!A:I,338,1),INDEX(Objednavka!A:I,338,3))","v":0},null,null,null,null,null,{"$f":"INDEX(Objednavka!A:I,338,4)","v":0},null,{"$f":"INDEX(Objednavka!A:I,338,5)","v":0},{"$f":"INDEX(Objednavka!A:I,338,7)","v":0},{"$f":"INDEX(Objednavka!A:I,338,8)","v":0},null,{"$f":"IF(INDEX(Objednavka!A:J,338,10)=\"\",\"\",INDEX(Objednavka!A:J,338,10))","v":""}]
[null,{"$f":"IF(INDEX(Objednavka!A:I,339,3)=\"\",INDEX(Objednavka!A:I,339,1),INDEX(Objednavka!A:I,339,3))","v":0},null,null,null,null,null,{"$f":"INDEX(Objednavka!A:I,339,4)","v":0},null,{"$f":"INDEX(Objednavka!A:I,339,5)","v":0},{"$f":"INDEX(Objednavka!A:I,339,7)","v":0},{"$f":"INDEX(Objednavka!A:I,339,8)","v":0},null,{"$f":"IF(INDEX(Objednavka!A:J,339,10)=\"\",\"\",INDEX(Objednavka!A:J,339,10))","v":""}]
[null,{"$f":"IF(INDEX(Objednavka!A:I,340,3)=\"\",INDEX(Objednavka!A:I,340,1),INDEX(Objednavka!A:I,340,3))","v":0},null,null,null,null,null,{"$f":"INDEX(Objednavka!A:I,340,4)","v":0},null,{"$f":"INDEX(Objednavka!A:I,340,5)","v":0},{"$f":"INDEX(Objednavka!A:I,340,7)","v":0},{"$f":"INDEX(Objednavka!A:I,340,8)","v":0},null,{"$f":"IF(INDEX(Objednavka!A:J,340,10)=\"\",\"\",INDEX(Objednavka!A:J,340,10))","v":""}]
[null,{"$f":"IF(INDEX(Objednavka!A:I,341,3)=\"\",INDEX(Objednavka!A:I,341,1),INDEX(Objednavka!A:I,341,3))","v":0},null,null,null,null,null,{"$f":"INDEX(Objednavka!A:I,341,4)","v":0},null,{"$f":"INDEX(Objednavka!A:I,341,5)","v":0},{"$f":"INDEX(Objednavka!A:I,341,7)","v":0},{"$f":"INDEX(Objednavka!A:I,341,8)","v":0},null,{"$f":"IF(INDEX(Objednavka!A:J,341,10)=\"\",\"\",INDEX(Objednavka!A:J,341,10))","v":""}]
[null,{"$f":"IF(INDEX(Objednavka!A:I,342,3)=\"\",INDEX(Objednavka!A:I,342,1),INDEX(Objednavka!A:I,342,3))","v":0},null,null,null,null,null,{"$f":"INDEX(Objednavka!A:I,342,4)","v":0},null,{"$f":"INDEX(Objednavka!A:I,342,5)","v":0},{"$f":"INDEX(Objednavka!A:I,342,7)","v":0},{"$f":"INDEX(Objednavka!A:I,342,8)","v":0},null,{"$f":"IF(INDEX(Objednavka!A:J,342,10)=\"\",\"\",INDEX(Objednavka!A:J,342,10))","v":""}]
[null,{"$f":"IF(INDEX(Objednavka!A:I,343,3)=\"\",INDEX(Objednavka!A:I,343,1),INDEX(Objednavka!A:I,343,3))","v":0},null,null,null,null,null,{"$f":"INDEX(Objednavka!A:I,343,4)","v":0},null,{"$f":"INDEX(Objednavka!A:I,343,5)","v":0},{"$f":"INDEX(Objednavka!A:I,343,7)","v":0},{"$f":"INDEX(Objednavka!A:I,343,8)","v":0},null,{"$f":"IF(INDEX(Objednavka!A:J,343,10)=\"\",\"\",INDEX(Objednavka!A:J,343,10))","v":""}]
[null,{"$f":"IF(INDEX(Objednavka!A:I,344,3)=\"\",INDEX(Objednavka!A:I,344,1),INDEX(Objednavka!A:I,344,3))","v":0},null,null,null,null,null,{"$f":"INDEX(Objednavka!A:I,344,4)","v":0},null,{"$f":"INDEX(Objednavka!A:I,344,5)","v":0},{"$f":"INDEX(Objednavka!A:I,344,7)","v":0},{"$f":"INDEX(Objednavka!A:I,344,8)","v":0},null,{"$f":"IF(INDEX(Objednavka!A:J,344,10)=\"\",\"\",INDEX(Objednavka!A:J,344,10))","v":""}]
[null,{"$f":"IF(INDEX(Objednavka!A:I,345,3)=\"\",INDEX(Objednavka!A:I,345,1),INDEX(Objednavka!A:I,345,3))","v":0},null,null,null,null,null,{"$f":"INDEX(Objednavka!A:I,345,4)","v":0},null,{"$f":"INDEX(Objednavka!A:I,345,5)","v":0},{"$f":"INDEX(Objednavka!A:I,345,7)","v":0},{"$f":"INDEX(Objednavka!A:I,345,8)","v":0},null,{"$f":"IF(INDEX(Objednavka!A:J,345,10)=\"\",\"\",INDEX(Objednavka!A:J,345,10))","v":""}]
[null,{"$f":"IF(INDEX(Objednavka!A:I,346,3)=\"\",INDEX(Objednavka!A:I,346,1),INDEX(Objednavka!A:I,346,3))","v":0},null,null,null,null,null,{"$f":"INDEX(Objednavka!A:I,346,4)","v":0},null,{"$f":"INDEX(Objednavka!A:I,346,5)","v":0},{"$f":"INDEX(Objednavka!A:I,346,7)","v":0},{"$f":"INDEX(Objednavka!A:I,346,8)","v":0},null,{"$f":"IF(INDEX(Objednavka!A:J,346,10)=\"\",\"\",INDEX(Objednavka!A:J,346,10))","v":""}]
[null,{"$f":"IF(INDEX(Objednavka!A:I,347,3)=\"\",INDEX(Objednavka!A:I,347,1),INDEX(Objednavka!A:I,347,3))","v":0},null,null,null,null,null,{"$f":"INDEX(Objednavka!A:I,347,4)","v":0},null,{"$f":"INDEX(Objednavka!A:I,347,5)","v":0},{"$f":"INDEX(Objednavka!A:I,347,7)","v":0},{"$f":"INDEX(Objednavka!A:I,347,8)","v":0},null,{"$f":"IF(INDEX(Objednavka!A:J,347,10)=\"\",\"\",INDEX(Objednavka!A:J,347,10))","v":""}]
[null,{"$f":"IF(INDEX(Objednavka!A:I,348,3)=\"\",INDEX(Objednavka!A:I,348,1),INDEX(Objednavka!A:I,348,3))","v":0},null,null,null,null,null,{"$f":"INDEX(Objednavka!A:I,348,4)","v":0},null,{"$f":"INDEX(Objednavka!A:I,348,5)","v":0},{"$f":"INDEX(Objednavka!A:I,348,7)","v":0},{"$f":"INDEX(Objednavka!A:I,348,8)","v":0},null,{"$f":"IF(INDEX(Objednavka!A:J,348,10)=\"\",\"\",INDEX(Objednavka!A:J,348,10))","v":""}]
[null,{"$f":"IF(INDEX(Objednavka!A:I,349,3)=\"\",INDEX(Objednavka!A:I,349,1),INDEX(Objednavka!A:I,349,3))","v":0},null,null,null,null,null,{"$f":"INDEX(Objednavka!A:I,349,4)","v":0},null,{"$f":"INDEX(Objednavka!A:I,349,5)","v":0},{"$f":"INDEX(Objednavka!A:I,349,7)","v":0},{"$f":"INDEX(Objednavka!A:I,349,8)","v":0},null,{"$f":"IF(INDEX(Objednavka!A:J,349,10)=\"\",\"\",INDEX(Objednavka!A:J,349,10))","v":""}]
[null,{"$f":"IF(INDEX(Objednavka!A:I,350,3)=\"\",INDEX(Objednavka!A:I,350,1),INDEX(Objednavka!A:I,350,3))","v":0},null,null,null,null,null,{"$f":"INDEX(Objednavka!A:I,350,4)","v":0},null,{"$f":"INDEX(Objednavka!A:I,350,5)","v":0},{"$f":"INDEX(Objednavka!A:I,350,7)","v":0},{"$f":"INDEX(Objednavka!A:I,350,8)","v":0},null,{"$f":"IF(INDEX(Objednavka!A:J,350,10)=\"\",\"\",INDEX(Objednavka!A:J,350,10))","v":""}]
[null,{"$f":"IF(INDEX(Objednavka!A:I,351,3)=\"\",INDEX(Objednavka!A:I,351,1),INDEX(Objednavka!A:I,351,3))","v":0},null,null,null,null,null,{"$f":"INDEX(Objednavka!A:I,351,4)","v":0},null,{"$f":"INDEX(Objednavka!A:I,351,5)","v":0},{"$f":"INDEX(Objednavka!A:I,351,7)","v":0},{"$f":"INDEX(Objednavka!A:I,351,8)","v":0},null,{"$f":"IF(INDEX(Objednavka!A:J,351,10)=\"\",\"\",INDEX(Objednavka!A:J,351,10))","v":""}]
[null,{"$f":"IF(INDEX(Objednavka!A:I,352,3)=\"\",INDEX(Objednavka!A:I,352,1),INDEX(Objednavka!A:I,352,3))","v":0},null,null,null,null,null,{"$f":"INDEX(Objednavka!A:I,352,4)","v":0},null,{"$f":"INDEX(Objednavka!A:I,352,5)","v":0},{"$f":"INDEX(Objednavka!A:I,352,7)","v":0},{"$f":"INDEX(Objednavka!A:I,352,8)","v":0},null,{"$f":"IF(INDEX(Objednavka!A:J,352,10)=\"\",\"\",INDEX(Objednavka!A:J,352,10))","v":""}]
[null,{"$f":"IF(INDEX(Objednavka!A:I,353,3)=\"\",INDEX(Objednavka!A:I,353,1),INDEX(Objednavka!A:I,353,3))","v":0},null,null,null,null,null,{"$f":"INDEX(Objednavka!A:I,353,4)","v":0},null,{"$f":"INDEX(Objednavka!A:I,353,5)","v":0},{"$f":"INDEX(Objednavka!A:I,353,7)","v":0},{"$f":"INDEX(Objednavka!A:I,353,8)","v":0},null,{"$f":"IF(INDEX(Objednavka!A:J,353,10)=\"\",\"\",INDEX(Objednavka!A:J,353,10))","v":""}]
[null,{"$f":"IF(INDEX(Objednavka!A:I,354,3)=\"\",INDEX(Objednavka!A:I,354,1),INDEX(Objednavka!A:I,354,3))","v":0},null,null,null,null,null,{"$f":"INDEX(Objednavka!A:I,354,4)","v":0},null,{"$f":"INDEX(Objednavka!A:I,354,5)","v":0},{"$f":"INDEX(Objednavka!A:I,354,7)","v":0},{"$f":"INDEX(Objednavka!A:I,354,8)","v":0},null,{"$f":"IF(INDEX(Objednavka!A:J,354,10)=\"\",\"\",INDEX(Objednavka!A:J,354,10))","v":""}]
[null,{"$f":"IF(INDEX(Objednavka!A:I,355,3)=\"\",INDEX(Objednavka!A:I,355,1),INDEX(Objednavka!A:I,355,3))","v":0},null,null,null,null,null,{"$f":"INDEX(Objednavka!A:I,355,4)","v":0},null,{"$f":"INDEX(Objednavka!A:I,355,5)","v":0},{"$f":"INDEX(Objednavka!A:I,355,7)","v":0},{"$f":"INDEX(Objednavka!A:I,355,8)","v":0},null,{"$f":"IF(INDEX(Objednavka!A:J,355,10)=\"\",\"\",INDEX(Objednavka!A:J,355,10))","v":""}]
[null,{"$f":"IF(INDEX(Objednavka!A:I,356,3)=\"\",INDEX(Objednavka!A:I,356,1),INDEX(Objednavka!A:I,356,3))","v":0},null,null,null,null,null,{"$f":"INDEX(Objednavka!A:I,356,4)","v":0},null,{"$f":"INDEX(Objednavka!A:I,356,5)","v":0},{"$f":"INDEX(Objednavka!A:I,356,7)","v":0},{"$f":"INDEX(Objednavka!A:I,356,8)","v":0},null,{"$f":"IF(INDEX(Objednavka!A:J,356,10)=\"\",\"\",INDEX(Objednavka!A:J,356,10))","v":""}]
[null,{"$f":"IF(INDEX(Objednavka!A:I,357,3)=\"\",INDEX(Objednavka!A:I,357,1),INDEX(Objednavka!A:I,357,3))","v":0},null,null,null,null,null,{"$f":"INDEX(Objednavka!A:I,357,4)","v":0},null,{"$f":"INDEX(Objednavka!A:I,357,5)","v":0},{"$f":"INDEX(Objednavka!A:I,357,7)","v":0},{"$f":"INDEX(Objednavka!A:I,357,8)","v":0},null,{"$f":"IF(INDEX(Objednavka!A:J,357,10)=\"\",\"\",INDEX(Objednavka!A:J,357,10))","v":""}]
[null,{"$f":"IF(INDEX(Objednavka!A:I,358,3)=\"\",INDEX(Objednavka!A:I,358,1),INDEX(Objednavka!A:I,358,3))","v":0},null,null,null,null,null,{"$f":"INDEX(Objednavka!A:I,358,4)","v":0},null,{"$f":"INDEX(Objednavka!A:I,358,5)","v":0},{"$f":"INDEX(Objednavka!A:I,358,7)","v":0},{"$f":"INDEX(Objednavka!A:I,358,8)","v":0},null,{"$f":"IF(INDEX(Objednavka!A:J,358,10)=\"\",\"\",INDEX(Objednavka!A:J,358,10))","v":""}]
[null,{"$f":"IF(INDEX(Objednavka!A:I,359,3)=\"\",INDEX(Objednavka!A:I,359,1),INDEX(Objednavka!A:I,359,3))","v":0},null,null,null,null,null,{"$f":"INDEX(Objednavka!A:I,359,4)","v":0},null,{"$f":"INDEX(Objednavka!A:I,359,5)","v":0},{"$f":"INDEX(Objednavka!A:I,359,7)","v":0},{"$f":"INDEX(Objednavka!A:I,359,8)","v":0},null,{"$f":"IF(INDEX(Objednavka!A:J,359,10)=\"\",\"\",INDEX(Objednavka!A:J,359,10))","v":""}]
[null,{"$f":"IF(INDEX(Objednavka!A:I,360,3)=\"\",INDEX(Objednavka!A:I,360,1),INDEX(Objednavka!A:I,360,3))","v":0},null,null,null,null,null,{"$f":"INDEX(Objednavka!A:I,360,4)","v":0},null,{"$f":"INDEX(Objednavka!A:I,360,5)","v":0},{"$f":"INDEX(Objednavka!A:I,360,7)","v":0},{"$f":"INDEX(Objednavka!A:I,360,8)","v":0},null,{"$f":"IF(INDEX(Objednavka!A:J,360,10)=\"\",\"\",INDEX(Objednavka!A:J,360,10))","v":""}]
[null,{"$f":"IF(INDEX(Objednavka!A:I,361,3)=\"\",INDEX(Objednavka!A:I,361,1),INDEX(Objednavka!A:I,361,3))","v":0},null,null,null,null,null,{"$f":"INDEX(Objednavka!A:I,361,4)","v":0},null,{"$f":"INDEX(Objednavka!A:I,361,5)","v":0},{"$f":"INDEX(Objednavka!A:I,361,7)","v":0},{"$f":"INDEX(Objednavka!A:I,361,8)","v":0},null,{"$f":"IF(INDEX(Objednavka!A:J,361,10)=\"\",\"\",INDEX(Objednavka!A:J,361,10))","v":""}]
[null,{"$f":"IF(INDEX(Objednavka!A:I,362,3)=\"\",INDEX(Objednavka!A:I,362,1),INDEX(Objednavka!A:I,362,3))","v":0},null,null,null,null,null,{"$f":"INDEX(Objednavka!A:I,362,4)","v":0},null,{"$f":"INDEX(Objednavka!A:I,362,5)","v":0},{"$f":"INDEX(Objednavka!A:I,362,7)","v":0},{"$f":"INDEX(Objednavka!A:I,362,8)","v":0},null,{"$f":"IF(INDEX(Objednavka!A:J,362,10)=\"\",\"\",INDEX(Objednavka!A:J,362,10))","v":""}]
[null,{"$f":"IF(INDEX(Objednavka!A:I,363,3)=\"\",INDEX(Objednavka!A:I,363,1),INDEX(Objednavka!A:I,363,3))","v":0},null,null,null,null,null,{"$f":"INDEX(Objednavka!A:I,363,4)","v":0},null,{"$f":"INDEX(Objednavka!A:I,363,5)","v":0},{"$f":"INDEX(Objednavka!A:I,363,7)","v":0},{"$f":"INDEX(Objednavka!A:I,363,8)","v":0},null,{"$f":"IF(INDEX(Objednavka!A:J,363,10)=\"\",\"\",INDEX(Objednavka!A:J,363,10))","v":""}]
[null,{"$f":"IF(INDEX(Objednavka!A:I,364,3)=\"\",INDEX(Objednavka!A:I,364,1),INDEX(Objednavka!A:I,364,3))","v":0},null,null,null,null,null,{"$f":"INDEX(Objednavka!A:I,364,4)","v":0},null,{"$f":"INDEX(Objednavka!A:I,364,5)","v":0},{"$f":"INDEX(Objednavka!A:I,364,7)","v":0},{"$f":"INDEX(Objednavka!A:I,364,8)","v":0},null,{"$f":"IF(INDEX(Objednavka!A:J,364,10)=\"\",\"\",INDEX(Objednavka!A:J,364,10))","v":""}]
[null,{"$f":"IF(INDEX(Objednavka!A:I,365,3)=\"\",INDEX(Objednavka!A:I,365,1),INDEX(Objednavka!A:I,365,3))","v":0},null,null,null,null,null,{"$f":"INDEX(Objednavka!A:I,365,4)","v":0},null,{"$f":"INDEX(Objednavka!A:I,365,5)","v":0},{"$f":"INDEX(Objednavka!A:I,365,7)","v":0},{"$f":"INDEX(Objednavka!A:I,365,8)","v":0},null,{"$f":"IF(INDEX(Objednavka!A:J,365,10)=\"\",\"\",INDEX(Objednavka!A:J,365,10))","v":""}]
[null,{"$f":"IF(INDEX(Objednavka!A:I,366,3)=\"\",INDEX(Objednavka!A:I,366,1),INDEX(Objednavka!A:I,366,3))","v":0},null,null,null,null,null,{"$f":"INDEX(Objednavka!A:I,366,4)","v":0},null,{"$f":"INDEX(Objednavka!A:I,366,5)","v":0},{"$f":"INDEX(Objednavka!A:I,366,7)","v":0},{"$f":"INDEX(Objednavka!A:I,366,8)","v":0},null,{"$f":"IF(INDEX(Objednavka!A:J,366,10)=\"\",\"\",INDEX(Objednavka!A:J,366,10))","v":""}]
[null,{"$f":"IF(INDEX(Objednavka!A:I,367,3)=\"\",INDEX(Objednavka!A:I,367,1),INDEX(Objednavka!A:I,367,3))","v":0},null,null,null,null,null,{"$f":"INDEX(Objednavka!A:I,367,4)","v":0},null,{"$f":"INDEX(Objednavka!A:I,367,5)","v":0},{"$f":"INDEX(Objednavka!A:I,367,7)","v":0},{"$f":"INDEX(Objednavka!A:I,367,8)","v":0},null,{"$f":"IF(INDEX(Objednavka!A:J,367,10)=\"\",\"\",INDEX(Objednavka!A:J,367,10))","v":""}]
[null,{"$f":"IF(INDEX(Objednavka!A:I,368,3)=\"\",INDEX(Objednavka!A:I,368,1),INDEX(Objednavka!A:I,368,3))","v":0},null,null,null,null,null,{"$f":"INDEX(Objednavka!A:I,368,4)","v":0},null,{"$f":"INDEX(Objednavka!A:I,368,5)","v":0},{"$f":"INDEX(Objednavka!A:I,368,7)","v":0},{"$f":"INDEX(Objednavka!A:I,368,8)","v":0},null,{"$f":"IF(INDEX(Objednavka!A:J,368,10)=\"\",\"\",INDEX(Objednavka!A:J,368,10))","v":""}]
[null,{"$f":"IF(INDEX(Objednavka!A:I,369,3)=\"\",INDEX(Objednavka!A:I,369,1),INDEX(Objednavka!A:I,369,3))","v":0},null,null,null,null,null,{"$f":"INDEX(Objednavka!A:I,369,4)","v":0},null,{"$f":"INDEX(Objednavka!A:I,369,5)","v":0},{"$f":"INDEX(Objednavka!A:I,369,7)","v":0},{"$f":"INDEX(Objednavka!A:I,369,8)","v":0},null,{"$f":"IF(INDEX(Objednavka!A:J,369,10)=\"\",\"\",INDEX(Objednavka!A:J,369,10))","v":""}]
[null,{"$f":"IF(INDEX(Objednavka!A:I,370,3)=\"\",INDEX(Objednavka!A:I,370,1),INDEX(Objednavka!A:I,370,3))","v":0},null,null,null,null,null,{"$f":"INDEX(Objednavka!A:I,370,4)","v":0},null,{"$f":"INDEX(Objednavka!A:I,370,5)","v":0},{"$f":"INDEX(Objednavka!A:I,370,7)","v":0},{"$f":"INDEX(Objednavka!A:I,370,8)","v":0},null,{"$f":"IF(INDEX(Objednavka!A:J,370,10)=\"\",\"\",INDEX(Objednavka!A:J,370,10))","v":""}]
[null,{"$f":"IF(INDEX(Objednavka!A:I,371,3)=\"\",INDEX(Objednavka!A:I,371,1),INDEX(Objednavka!A:I,371,3))","v":0},null,null,null,null,null,{"$f":"INDEX(Objednavka!A:I,371,4)","v":0},null,{"$f":"INDEX(Objednavka!A:I,371,5)","v":0},{"$f":"INDEX(Objednavka!A:I,371,7)","v":0},{"$f":"INDEX(Objednavka!A:I,371,8)","v":0},null,{"$f":"IF(INDEX(Objednavka!A:J,371,10)=\"\",\"\",INDEX(Objednavka!A:J,371,10))","v":""}]
[null,{"$f":"IF(INDEX(Objednavka!A:I,372,3)=\"\",INDEX(Objednavka!A:I,372,1),INDEX(Objednavka!A:I,372,3))","v":0},null,null,null,null,null,{"$f":"INDEX(Objednavka!A:I,372,4)","v":0},null,{"$f":"INDEX(Objednavka!A:I,372,5)","v":0},{"$f":"INDEX(Objednavka!A:I,372,7)","v":0},{"$f":"INDEX(Objednavka!A:I,372,8)","v":0},null,{"$f":"IF(INDEX(Objednavka!A:J,372,10)=\"\",\"\",INDEX(Objednavka!A:J,372,10))","v":""}]
[null,{"$f":"IF(INDEX(Objednavka!A:I,373,3)=\"\",INDEX(Objednavka!A:I,373,1),INDEX(Objednavka!A:I,373,3))","v":0},null,null,null,null,null,{"$f":"INDEX(Objednavka!A:I,373,4)","v":0},null,{"$f":"INDEX(Objednavka!A:I,373,5)","v":0},{"$f":"INDEX(Objednavka!A:I,373,7)","v":0},{"$f":"INDEX(Objednavka!A:I,373,8)","v":0},null,{"$f":"IF(INDEX(Objednavka!A:J,373,10)=\"\",\"\",INDEX(Objednavka!A:J,373,10))","v":""}]
[null,{"$f":"IF(INDEX(Objednavka!A:I,374,3)=\"\",INDEX(Objednavka!A:I,374,1),INDEX(Objednavka!A:I,374,3))","v":0},null,null,null,null,null,{"$f":"INDEX(Objednavka!A:I,374,4)","v":0},null,{"$f":"INDEX(Objednavka!A:I,374,5)","v":0},{"$f":"INDEX(Objednavka!A:I,374,7)","v":0},{"$f":"INDEX(Objednavka!A:I,374,8)","v":0},null,{"$f":"IF(INDEX(Objednavka!A:J,374,10)=\"\",\"\",INDEX(Objednavka!A:J,374,10))","v":""}]
[null,{"$f":"IF(INDEX(Objednavka!A:I,375,3)=\"\",INDEX(Objednavka!A:I,375,1),INDEX(Objednavka!A:I,375,3))","v":0},null,null,null,null,null,{"$f":"INDEX(Objednavka!A:I,375,4)","v":0},null,{"$f":"INDEX(Objednavka!A:I,375,5)","v":0},{"$f":"INDEX(Objednavka!A:I,375,7)","v":0},{"$f":"INDEX(Objednavka!A:I,375,8)","v":0},null,{"$f":"IF(INDEX(Objednavka!A:J,375,10)=\"\",\"\",INDEX(Objednavka!A:J,375,10))","v":""}]
[null,{"$f":"IF(INDEX(Objednavka!A:I,376,3)=\"\",INDEX(Objednavka!A:I,376,1),INDEX(Objednavka!A:I,376,3))","v":0},null,null,null,null,null,{"$f":"INDEX(Objednavka!A:I,376,4)","v":0},null,{"$f":"INDEX(Objednavka!A:I,376,5)","v":0},{"$f":"INDEX(Objednavka!A:I,376,7)","v":0},{"$f":"INDEX(Objednavka!A:I,376,8)","v":0},null,{"$f":"IF(INDEX(Objednavka!A:J,376,10)=\"\",\"\",INDEX(Objednavka!A:J,376,10))","v":""}]
[null,{"$f":"IF(INDEX(Objednavka!A:I,377,3)=\"\",INDEX(Objednavka!A:I,377,1),INDEX(Objednavka!A:I,377,3))","v":0},null,null,null,null,null,{"$f":"INDEX(Objednavka!A:I,377,4)","v":0},null,{"$f":"INDEX(Objednavka!A:I,377,5)","v":0},{"$f":"INDEX(Objednavka!A:I,377,7)","v":0},{"$f":"INDEX(Objednavka!A:I,377,8)","v":0},null,{"$f":"IF(INDEX(Objednavka!A:J,377,10)=\"\",\"\",INDEX(Objednavka!A:J,377,10))","v":""}]
[null,{"$f":"IF(INDEX(Objednavka!A:I,378,3)=\"\",INDEX(Objednavka!A:I,378,1),INDEX(Objednavka!A:I,378,3))","v":0},null,null,null,null,null,{"$f":"INDEX(Objednavka!A:I,378,4)","v":0},null,{"$f":"INDEX(Objednavka!A:I,378,5)","v":0},{"$f":"INDEX(Objednavka!A:I,378,7)","v":0},{"$f":"INDEX(Objednavka!A:I,378,8)","v":0},null,{"$f":"IF(INDEX(Objednavka!A:J,378,10)=\"\",\"\",INDEX(Objednavka!A:J,378,10))","v":""}]
[null,{"$f":"IF(INDEX(Objednavka!A:I,379,3)=\"\",INDEX(Objednavka!A:I,379,1),INDEX(Objednavka!A:I,379,3))","v":0},null,null,null,null,null,{"$f":"INDEX(Objednavka!A:I,379,4)","v":0},null,{"$f":"INDEX(Objednavka!A:I,379,5)","v":0},{"$f":"INDEX(Objednavka!A:I,379,7)","v":0},{"$f":"INDEX(Objednavka!A:I,379,8)","v":0},null,{"$f":"IF(INDEX(Objednavka!A:J,379,10)=\"\",\"\",INDEX(Objednavka!A:J,379,10))","v":""}]
[null,{"$f":"IF(INDEX(Objednavka!A:I,380,3)=\"\",INDEX(Objednavka!A:I,380,1),INDEX(Objednavka!A:I,380,3))","v":0},null,null,null,null,null,{"$f":"INDEX(Objednavka!A:I,380,4)","v":0},null,{"$f":"INDEX(Objednavka!A:I,380,5)","v":0},{"$f":"INDEX(Objednavka!A:I,380,7)","v":0},{"$f":"INDEX(Objednavka!A:I,380,8)","v":0},null,{"$f":"IF(INDEX(Objednavka!A:J,380,10)=\"\",\"\",INDEX(Objednavka!A:J,380,10))","v":""}]
[null,{"$f":"IF(INDEX(Objednavka!A:I,381,3)=\"\",INDEX(Objednavka!A:I,381,1),INDEX(Objednavka!A:I,381,3))","v":0},null,null,null,null,null,{"$f":"INDEX(Objednavka!A:I,381,4)","v":0},null,{"$f":"INDEX(Objednavka!A:I,381,5)","v":0},{"$f":"INDEX(Objednavka!A:I,381,7)","v":0},{"$f":"INDEX(Objednavka!A:I,381,8)","v":0},null,{"$f":"IF(INDEX(Objednavka!A:J,381,10)=\"\",\"\",INDEX(Objednavka!A:J,381,10))","v":""}]
[null,{"$f":"IF(INDEX(Objednavka!A:I,382,3)=\"\",INDEX(Objednavka!A:I,382,1),INDEX(Objednavka!A:I,382,3))","v":0},null,null,null,null,null,{"$f":"INDEX(Objednavka!A:I,382,4)","v":0},null,{"$f":"INDEX(Objednavka!A:I,382,5)","v":0},{"$f":"INDEX(Objednavka!A:I,382,7)","v":0},{"$f":"INDEX(Objednavka!A:I,382,8)","v":0},null,{"$f":"IF(INDEX(Objednavka!A:J,382,10)=\"\",\"\",INDEX(Objednavka!A:J,382,10))","v":""}]
[null,{"$f":"IF(INDEX(Objednavka!A:I,383,3)=\"\",INDEX(Objednavka!A:I,383,1),INDEX(Objednavka!A:I,383,3))","v":0},null,null,null,null,null,{"$f":"INDEX(Objednavka!A:I,383,4)","v":0},null,{"$f":"INDEX(Objednavka!A:I,383,5)","v":0},{"$f":"INDEX(Objednavka!A:I,383,7)","v":0},{"$f":"INDEX(Objednavka!A:I,383,8)","v":0},null,{"$f":"IF(INDEX(Objednavka!A:J,383,10)=\"\",\"\",INDEX(Objednavka!A:J,383,10))","v":""}]
[null,{"$f":"IF(INDEX(Objednavka!A:I,384,3)=\"\",INDEX(Objednavka!A:I,384,1),INDEX(Objednavka!A:I,384,3))","v":0},null,null,null,null,null,{"$f":"INDEX(Objednavka!A:I,384,4)","v":0},null,{"$f":"INDEX(Objednavka!A:I,384,5)","v":0},{"$f":"INDEX(Objednavka!A:I,384,7)","v":0},{"$f":"INDEX(Objednavka!A:I,384,8)","v":0},null,{"$f":"IF(INDEX(Objednavka!A:J,384,10)=\"\",\"\",INDEX(Objednavka!A:J,384,10))","v":""}]
[null,{"$f":"IF(INDEX(Objednavka!A:I,385,3)=\"\",INDEX(Objednavka!A:I,385,1),INDEX(Objednavka!A:I,385,3))","v":0},null,null,null,null,null,{"$f":"INDEX(Objednavka!A:I,385,4)","v":0},null,{"$f":"INDEX(Objednavka!A:I,385,5)","v":0},{"$f":"INDEX(Objednavka!A:I,385,7)","v":0},{"$f":"INDEX(Objednavka!A:I,385,8)","v":0},null,{"$f":"IF(INDEX(Objednavka!A:J,385,10)=\"\",\"\",INDEX(Objednavka!A:J,385,10))","v":""}]
[null,{"$f":"IF(INDEX(Objednavka!A:I,386,3)=\"\",INDEX(Objednavka!A:I,386,1),INDEX(Objednavka!A:I,386,3))","v":0},null,null,null,null,null,{"$f":"INDEX(Objednavka!A:I,386,4)","v":0},null,{"$f":"INDEX(Objednavka!A:I,386,5)","v":0},{"$f":"INDEX(Objednavka!A:I,386,7)","v":0},{"$f":"INDEX(Objednavka!A:I,386,8)","v":0},null,{"$f":"IF(INDEX(Objednavka!A:J,386,10)=\"\",\"\",INDEX(Objednavka!A:J,386,10))","v":""}]
[null,{"$f":"IF(INDEX(Objednavka!A:I,387,3)=\"\",INDEX(Objednavka!A:I,387,1),INDEX(Objednavka!A:I,387,3))","v":0},null,null,null,null,null,{"$f":"INDEX(Objednavka!A:I,387,4)","v":0},null,{"$f":"INDEX(Objednavka!A:I,387,5)","v":0},{"$f":"INDEX(Objednavka!A:I,387,7)","v":0},{"$f":"INDEX(Objednavka!A:I,387,8)","v":0},null,{"$f":"IF(INDEX(Objednavka!A:J,387,10)=\"\",\"\",INDEX(Objednavka!A:J,387,10))","v":""}]
[null,{"$f":"IF(INDEX(Objednavka!A:I,388,3)=\"\",INDEX(Objednavka!A:I,388,1),INDEX(Objednavka!A:I,388,3))","v":0},null,null,null,null,null,{"$f":"INDEX(Objednavka!A:I,388,4)","v":0},null,{"$f":"INDEX(Objednavka!A:I,388,5)","v":0},{"$f":"INDEX(Objednavka!A:I,388,7)","v":0},{"$f":"INDEX(Objednavka!A:I,388,8)","v":0},null,{"$f":"IF(INDEX(Objednavka!A:J,388,10)=\"\",\"\",INDEX(Objednavka!A:J,388,10))","v":""}]
[null,{"$f":"IF(INDEX(Objednavka!A:I,389,3)=\"\",INDEX(Objednavka!A:I,389,1),INDEX(Objednavka!A:I,389,3))","v":0},null,null,null,null,null,{"$f":"INDEX(Objednavka!A:I,389,4)","v":0},null,{"$f":"INDEX(Objednavka!A:I,389,5)","v":0},{"$f":"INDEX(Objednavka!A:I,389,7)","v":0},{"$f":"INDEX(Objednavka!A:I,389,8)","v":0},null,{"$f":"IF(INDEX(Objednavka!A:J,389,10)=\"\",\"\",INDEX(Objednavka!A:J,389,10))","v":""}]
[null,{"$f":"IF(INDEX(Objednavka!A:I,390,3)=\"\",INDEX(Objednavka!A:I,390,1),INDEX(Objednavka!A:I,390,3))","v":0},null,null,null,null,null,{"$f":"INDEX(Objednavka!A:I,390,4)","v":0},null,{"$f":"INDEX(Objednavka!A:I,390,5)","v":0},{"$f":"INDEX(Objednavka!A:I,390,7)","v":0},{"$f":"INDEX(Objednavka!A:I,390,8)","v":0},null,{"$f":"IF(INDEX(Objednavka!A:J,390,10)=\"\",\"\",INDEX(Objednavka!A:J,390,10))","v":""}]
[null,{"$f":"IF(INDEX(Objednavka!A:I,391,3)=\"\",INDEX(Objednavka!A:I,391,1),INDEX(Objednavka!A:I,391,3))","v":0},null,null,null,null,null,{"$f":"INDEX(Objednavka!A:I,391,4)","v":0},null,{"$f":"INDEX(Objednavka!A:I,391,5)","v":0},{"$f":"INDEX(Objednavka!A:I,391,7)","v":0},{"$f":"INDEX(Objednavka!A:I,391,8)","v":0},null,{"$f":"IF(INDEX(Objednavka!A:J,391,10)=\"\",\"\",INDEX(Objednavka!A:J,391,10))","v":""}]
[null,{"$f":"IF(INDEX(Objednavka!A:I,392,3)=\"\",INDEX(Objednavka!A:I,392,1),INDEX(Objednavka!A:I,392,3))","v":0},null,null,null,null,null,{"$f":"INDEX(Objednavka!A:I,392,4)","v":0},null,{"$f":"INDEX(Objednavka!A:I,392,5)","v":0},{"$f":"INDEX(Objednavka!A:I,392,7)","v":0},{"$f":"INDEX(Objednavka!A:I,392,8)","v":0},null,{"$f":"IF(INDEX(Objednavka!A:J,392,10)=\"\",\"\",INDEX(Objednavka!A:J,392,10))","v":""}]
[null,{"$f":"IF(INDEX(Objednavka!A:I,393,3)=\"\",INDEX(Objednavka!A:I,393,1),INDEX(Objednavka!A:I,393,3))","v":0},null,null,null,null,null,{"$f":"INDEX(Objednavka!A:I,393,4)","v":0},null,{"$f":"INDEX(Objednavka!A:I,393,5)","v":0},{"$f":"INDEX(Objednavka!A:I,393,7)","v":0},{"$f":"INDEX(Objednavka!A:I,393,8)","v":0},null,{"$f":"IF(INDEX(Objednavka!A:J,393,10)=\"\",\"\",INDEX(Objednavka!A:J,393,10))","v":""}]
[null,{"$f":"IF(INDEX(Objednavka!A:I,394,3)=\"\",INDEX(Objednavka!A:I,394,1),INDEX(Objednavka!A:I,394,3))","v":0},null,null,null,null,null,{"$f":"INDEX(Objednavka!A:I,394,4)","v":0},null,{"$f":"INDEX(Objednavka!A:I,394,5)","v":0},{"$f":"INDEX(Objednavka!A:I,394,7)","v":0},{"$f":"INDEX(Objednavka!A:I,394,8)","v":0},null,{"$f":"IF(INDEX(Objednavka!A:J,394,10)=\"\",\"\",INDEX(Objednavka!A:J,394,10))","v":""}]
[null,{"$f":"IF(INDEX(Objednavka!A:I,395,3)=\"\",INDEX(Objednavka!A:I,395,1),INDEX(Objednavka!A:I,395,3))","v":0},null,null,null,null,null,{"$f":"INDEX(Objednavka!A:I,395,4)","v":0},null,{"$f":"INDEX(Objednavka!A:I,395,5)","v":0},{"$f":"INDEX(Objednavka!A:I,395,7)","v":0},{"$f":"INDEX(Objednavka!A:I,395,8)","v":0},null,{"$f":"IF(INDEX(Objednavka!A:J,395,10)=\"\",\"\",INDEX(Objednavka!A:J,395,10))","v":""}]
[null,{"$f":"IF(INDEX(Objednavka!A:I,396,3)=\"\",INDEX(Objednavka!A:I,396,1),INDEX(Objednavka!A:I,396,3))","v":0},null,null,null,null,null,{"$f":"INDEX(Objednavka!A:I,396,4)","v":0},null,{"$f":"INDEX(Objednavka!A:I,396,5)","v":0},{"$f":"INDEX(Objednavka!A:I,396,7)","v":0},{"$f":"INDEX(Objednavka!A:I,396,8)","v":0},null,{"$f":"IF(INDEX(Objednavka!A:J,396,10)=\"\",\"\",INDEX(Objednavka!A:J,396,10))","v":""}]
[null,{"$f":"IF(INDEX(Objednavka!A:I,397,3)=\"\",INDEX(Objednavka!A:I,397,1),INDEX(Objednavka!A:I,397,3))","v":0},null,null,null,null,null,{"$f":"INDEX(Objednavka!A:I,397,4)","v":0},null,{"$f":"INDEX(Objednavka!A:I,397,5)","v":0},{"$f":"INDEX(Objednavka!A:I,397,7)","v":0},{"$f":"INDEX(Objednavka!A:I,397,8)","v":0},null,{"$f":"IF(INDEX(Objednavka!A:J,397,10)=\"\",\"\",INDEX(Objednavka!A:J,397,10))","v":""}]
[null,{"$f":"IF(INDEX(Objednavka!A:I,398,3)=\"\",INDEX(Objednavka!A:I,398,1),INDEX(Objednavka!A:I,398,3))","v":0},null,null,null,null,null,{"$f":"INDEX(Objednavka!A:I,398,4)","v":0},null,{"$f":"INDEX(Objednavka!A:I,398,5)","v":0},{"$f":"INDEX(Objednavka!A:I,398,7)","v":0},{"$f":"INDEX(Objednavka!A:I,398,8)","v":0},null,{"$f":"IF(INDEX(Objednavka!A:J,398,10)=\"\",\"\",INDEX(Objednavka!A:J,398,10))","v":""}]
[null,{"$f":"IF(INDEX(Objednavka!A:I,399,3)=\"\",INDEX(Objednavka!A:I,399,1),INDEX(Objednavka!A:I,399,3))","v":0},null,null,null,null,null,{"$f":"INDEX(Objednavka!A:I,399,4)","v":0},null,{"$f":"INDEX(Objednavka!A:I,399,5)","v":0},{"$f":"INDEX(Objednavka!A:I,399,7)","v":0},{"$f":"INDEX(Objednavka!A:I,399,8)","v":0},null,{"$f":"IF(INDEX(Objednavka!A:J,399,10)=\"\",\"\",INDEX(Objednavka!A:J,399,10))","v":""}]
[null,{"$f":"IF(INDEX(Objednavka!A:I,400,3)=\"\",INDEX(Objednavka!A:I,400,1),INDEX(Objednavka!A:I,400,3))","v":0},null,null,null,null,null,{"$f":"INDEX(Objednavka!A:I,400,4)","v":0},null,{"$f":"INDEX(Objednavka!A:I,400,5)","v":0},{"$f":"INDEX(Objednavka!A:I,400,7)","v":0},{"$f":"INDEX(Objednavka!A:I,400,8)","v":0},null,{"$f":"IF(INDEX(Objednavka!A:J,400,10)=\"\",\"\",INDEX(Objednavka!A:J,400,10))","v":""}]
[null,{"$f":"IF(INDEX(Objednavka!A:I,401,3)=\"\",INDEX(Objednavka!A:I,401,1),INDEX(Objednavka!A:I,401,3))","v":0},null,null,null,null,null,{"$f":"INDEX(Objednavka!A:I,401,4)","v":0},null,{"$f":"INDEX(Objednavka!A:I,401,5)","v":0},{"$f":"INDEX(Objednavka!A:I,401,7)","v":0},{"$f":"INDEX(Objednavka!A:I,401,8)","v":0},null,{"$f":"IF(INDEX(Objednavka!A:J,401,10)=\"\",\"\",INDEX(Objednavka!A:J,401,10))","v":""}]
[null,{"$f":"IF(INDEX(Objednavka!A:I,402,3)=\"\",INDEX(Objednavka!A:I,402,1),INDEX(Objednavka!A:I,402,3))","v":0},null,null,null,null,null,{"$f":"INDEX(Objednavka!A:I,402,4)","v":0},null,{"$f":"INDEX(Objednavka!A:I,402,5)","v":0},{"$f":"INDEX(Objednavka!A:I,402,7)","v":0},{"$f":"INDEX(Objednavka!A:I,402,8)","v":0},null,{"$f":"IF(INDEX(Objednavka!A:J,402,10)=\"\",\"\",INDEX(Objednavka!A:J,402,10))","v":""}]
[null,{"$f":"IF(INDEX(Objednavka!A:I,403,3)=\"\",INDEX(Objednavka!A:I,403,1),INDEX(Objednavka!A:I,403,3))","v":0},null,null,null,null,null,{"$f":"INDEX(Objednavka!A:I,403,4)","v":0},null,{"$f":"INDEX(Objednavka!A:I,403,5)","v":0},{"$f":"INDEX(Objednavka!A:I,403,7)","v":0},{"$f":"INDEX(Objednavka!A:I,403,8)","v":0},null,{"$f":"IF(INDEX(Objednavka!A:J,403,10)=\"\",\"\",INDEX(Objednavka!A:J,403,10))","v":""}]
[null,{"$f":"IF(INDEX(Objednavka!A:I,404,3)=\"\",INDEX(Objednavka!A:I,404,1),INDEX(Objednavka!A:I,404,3))","v":0},null,null,null,null,null,{"$f":"INDEX(Objednavka!A:I,404,4)","v":0},null,{"$f":"INDEX(Objednavka!A:I,404,5)","v":0},{"$f":"INDEX(Objednavka!A:I,404,7)","v":0},{"$f":"INDEX(Objednavka!A:I,404,8)","v":0},null,{"$f":"IF(INDEX(Objednavka!A:J,404,10)=\"\",\"\",INDEX(Objednavka!A:J,404,10))","v":""}]
[null,{"$f":"IF(INDEX(Objednavka!A:I,405,3)=\"\",INDEX(Objednavka!A:I,405,1),INDEX(Objednavka!A:I,405,3))","v":0},null,null,null,null,null,{"$f":"INDEX(Objednavka!A:I,405,4)","v":0},null,{"$f":"INDEX(Objednavka!A:I,405,5)","v":0},{"$f":"INDEX(Objednavka!A:I,405,7)","v":0},{"$f":"INDEX(Objednavka!A:I,405,8)","v":0},null,{"$f":"IF(INDEX(Objednavka!A:J,405,10)=\"\",\"\",INDEX(Objednavka!A:J,405,10))","v":""}]
[null,{"$f":"IF(INDEX(Objednavka!A:I,406,3)=\"\",INDEX(Objednavka!A:I,406,1),INDEX(Objednavka!A:I,406,3))","v":0},null,null,null,null,null,{"$f":"INDEX(Objednavka!A:I,406,4)","v":0},null,{"$f":"INDEX(Objednavka!A:I,406,5)","v":0},{"$f":"INDEX(Objednavka!A:I,406,7)","v":0},{"$f":"INDEX(Objednavka!A:I,406,8)","v":0},null,{"$f":"IF(INDEX(Objednavka!A:J,406,10)=\"\",\"\",INDEX(Objednavka!A:J,406,10))","v":""}]
[null,{"$f":"IF(INDEX(Objednavka!A:I,407,3)=\"\",INDEX(Objednavka!A:I,407,1),INDEX(Objednavka!A:I,407,3))","v":0},null,null,null,null,null,{"$f":"INDEX(Objednavka!A:I,407,4)","v":0},null,{"$f":"INDEX(Objednavka!A:I,407,5)","v":0},{"$f":"INDEX(Objednavka!A:I,407,7)","v":0},{"$f":"INDEX(Objednavka!A:I,407,8)","v":0},null,{"$f":"IF(INDEX(Objednavka!A:J,407,10)=\"\",\"\",INDEX(Objednavka!A:J,407,10))","v":""}]
[null,{"$f":"IF(INDEX(Objednavka!A:I,408,3)=\"\",INDEX(Objednavka!A:I,408,1),INDEX(Objednavka!A:I,408,3))","v":0},null,null,null,null,null,{"$f":"INDEX(Objednavka!A:I,408,4)","v":0},null,{"$f":"INDEX(Objednavka!A:I,408,5)","v":0},{"$f":"INDEX(Objednavka!A:I,408,7)","v":0},{"$f":"INDEX(Objednavka!A:I,408,8)","v":0},null,{"$f":"IF(INDEX(Objednavka!A:J,408,10)=\"\",\"\",INDEX(Objednavka!A:J,408,10))","v":""}]
[null,{"$f":"IF(INDEX(Objednavka!A:I,409,3)=\"\",INDEX(Objednavka!A:I,409,1),INDEX(Objednavka!A:I,409,3))","v":0},null,null,null,null,null,{"$f":"INDEX(Objednavka!A:I,409,4)","v":0},null,{"$f":"INDEX(Objednavka!A:I,409,5)","v":0},{"$f":"INDEX(Objednavka!A:I,409,7)","v":0},{"$f":"INDEX(Objednavka!A:I,409,8)","v":0},null,{"$f":"IF(INDEX(Objednavka!A:J,409,10)=\"\",\"\",INDEX(Objednavka!A:J,409,10))","v":""}]
[null,{"$f":"IF(INDEX(Objednavka!A:I,410,3)=\"\",INDEX(Objednavka!A:I,410,1),INDEX(Objednavka!A:I,410,3))","v":0},null,null,null,null,null,{"$f":"INDEX(Objednavka!A:I,410,4)","v":0},null,{"$f":"INDEX(Objednavka!A:I,410,5)","v":0},{"$f":"INDEX(Objednavka!A:I,410,7)","v":0},{"$f":"INDEX(Objednavka!A:I,410,8)","v":0},null,{"$f":"IF(INDEX(Objednavka!A:J,410,10)=\"\",\"\",INDEX(Objednavka!A:J,410,10))","v":""}]
[null,{"$f":"IF(INDEX(Objednavka!A:I,411,3)=\"\",INDEX(Objednavka!A:I,411,1),INDEX(Objednavka!A:I,411,3))","v":0},null,null,null,null,null,{"$f":"INDEX(Objednavka!A:I,411,4)","v":0},null,{"$f":"INDEX(Objednavka!A:I,411,5)","v":0},{"$f":"INDEX(Objednavka!A:I,411,7)","v":0},{"$f":"INDEX(Objednavka!A:I,411,8)","v":0},null,{"$f":"IF(INDEX(Objednavka!A:J,411,10)=\"\",\"\",INDEX(Objednavka!A:J,411,10))","v":""}]
[null,{"$f":"IF(INDEX(Objednavka!A:I,412,3)=\"\",INDEX(Objednavka!A:I,412,1),INDEX(Objednavka!A:I,412,3))","v":0},null,null,null,null,null,{"$f":"INDEX(Objednavka!A:I,412,4)","v":0},null,{"$f":"INDEX(Objednavka!A:I,412,5)","v":0},{"$f":"INDEX(Objednavka!A:I,412,7)","v":0},{"$f":"INDEX(Objednavka!A:I,412,8)","v":0},null,{"$f":"IF(INDEX(Objednavka!A:J,412,10)=\"\",\"\",INDEX(Objednavka!A:J,412,10))","v":""}]
[null,{"$f":"IF(INDEX(Objednavka!A:I,413,3)=\"\",INDEX(Objednavka!A:I,413,1),INDEX(Objednavka!A:I,413,3))","v":0},null,null,null,null,null,{"$f":"INDEX(Objednavka!A:I,413,4)","v":0},null,{"$f":"INDEX(Objednavka!A:I,413,5)","v":0},{"$f":"INDEX(Objednavka!A:I,413,7)","v":0},{"$f":"INDEX(Objednavka!A:I,413,8)","v":0},null,{"$f":"IF(INDEX(Objednavka!A:J,413,10)=\"\",\"\",INDEX(Objednavka!A:J,413,10))","v":""}]
[null,{"$f":"IF(INDEX(Objednavka!A:I,414,3)=\"\",INDEX(Objednavka!A:I,414,1),INDEX(Objednavka!A:I,414,3))","v":0},null,null,null,null,null,{"$f":"INDEX(Objednavka!A:I,414,4)","v":0},null,{"$f":"INDEX(Objednavka!A:I,414,5)","v":0},{"$f":"INDEX(Objednavka!A:I,414,7)","v":0},{"$f":"INDEX(Objednavka!A:I,414,8)","v":0},null,{"$f":"IF(INDEX(Objednavka!A:J,414,10)=\"\",\"\",INDEX(Objednavka!A:J,414,10))","v":""}]
[null,{"$f":"IF(INDEX(Objednavka!A:I,415,3)=\"\",INDEX(Objednavka!A:I,415,1),INDEX(Objednavka!A:I,415,3))","v":0},null,null,null,null,null,{"$f":"INDEX(Objednavka!A:I,415,4)","v":0},null,{"$f":"INDEX(Objednavka!A:I,415,5)","v":0},{"$f":"INDEX(Objednavka!A:I,415,7)","v":0},{"$f":"INDEX(Objednavka!A:I,415,8)","v":0},null,{"$f":"IF(INDEX(Objednavka!A:J,415,10)=\"\",\"\",INDEX(Objednavka!A:J,415,10))","v":""}]
[null,{"$f":"IF(INDEX(Objednavka!A:I,416,3)=\"\",INDEX(Objednavka!A:I,416,1),INDEX(Objednavka!A:I,416,3))","v":0},null,null,null,null,null,{"$f":"INDEX(Objednavka!A:I,416,4)","v":0},null,{"$f":"INDEX(Objednavka!A:I,416,5)","v":0},{"$f":"INDEX(Objednavka!A:I,416,7)","v":0},{"$f":"INDEX(Objednavka!A:I,416,8)","v":0},null,{"$f":"IF(INDEX(Objednavka!A:J,416,10)=\"\",\"\",INDEX(Objednavka!A:J,416,10))","v":""}]
[null,{"$f":"IF(INDEX(Objednavka!A:I,417,3)=\"\",INDEX(Objednavka!A:I,417,1),INDEX(Objednavka!A:I,417,3))","v":0},null,null,null,null,null,{"$f":"INDEX(Objednavka!A:I,417,4)","v":0},null,{"$f":"INDEX(Objednavka!A:I,417,5)","v":0},{"$f":"INDEX(Objednavka!A:I,417,7)","v":0},{"$f":"INDEX(Objednavka!A:I,417,8)","v":0},null,{"$f":"IF(INDEX(Objednavka!A:J,417,10)=\"\",\"\",INDEX(Objednavka!A:J,417,10))","v":""}]
[null,{"$f":"IF(INDEX(Objednavka!A:I,418,3)=\"\",INDEX(Objednavka!A:I,418,1),INDEX(Objednavka!A:I,418,3))","v":0},null,null,null,null,null,{"$f":"INDEX(Objednavka!A:I,418,4)","v":0},null,{"$f":"INDEX(Objednavka!A:I,418,5)","v":0},{"$f":"INDEX(Objednavka!A:I,418,7)","v":0},{"$f":"INDEX(Objednavka!A:I,418,8)","v":0},null,{"$f":"IF(INDEX(Objednavka!A:J,418,10)=\"\",\"\",INDEX(Objednavka!A:J,418,10))","v":""}]
[null,{"$f":"IF(INDEX(Objednavka!A:I,419,3)=\"\",INDEX(Objednavka!A:I,419,1),INDEX(Objednavka!A:I,419,3))","v":0},null,null,null,null,null,{"$f":"INDEX(Objednavka!A:I,419,4)","v":0},null,{"$f":"INDEX(Objednavka!A:I,419,5)","v":0},{"$f":"INDEX(Objednavka!A:I,419,7)","v":0},{"$f":"INDEX(Objednavka!A:I,419,8)","v":0},null,{"$f":"IF(INDEX(Objednavka!A:J,419,10)=\"\",\"\",INDEX(Objednavka!A:J,419,10))","v":""}]
[null,{"$f":"IF(INDEX(Objednavka!A:I,420,3)=\"\",INDEX(Objednavka!A:I,420,1),INDEX(Objednavka!A:I,420,3))","v":0},null,null,null,null,null,{"$f":"INDEX(Objednavka!A:I,420,4)","v":0},null,{"$f":"INDEX(Objednavka!A:I,420,5)","v":0},{"$f":"INDEX(Objednavka!A:I,420,7)","v":0},{"$f":"INDEX(Objednavka!A:I,420,8)","v":0},null,{"$f":"IF(INDEX(Objednavka!A:J,420,10)=\"\",\"\",INDEX(Objednavka!A:J,420,10))","v":""}]
[null,{"$f":"IF(INDEX(Objednavka!A:I,421,3)=\"\",INDEX(Objednavka!A:I,421,1),INDEX(Objednavka!A:I,421,3))","v":0},null,null,null,null,null,{"$f":"INDEX(Objednavka!A:I,421,4)","v":0},null,{"$f":"INDEX(Objednavka!A:I,421,5)","v":0},{"$f":"INDEX(Objednavka!A:I,421,7)","v":0},{"$f":"INDEX(Objednavka!A:I,421,8)","v":0},null,{"$f":"IF(INDEX(Objednavka!A:J,421,10)=\"\",\"\",INDEX(Objednavka!A:J,421,10))","v":""}]
[null,{"$f":"IF(INDEX(Objednavka!A:I,422,3)=\"\",INDEX(Objednavka!A:I,422,1),INDEX(Objednavka!A:I,422,3))","v":0},null,null,null,null,null,{"$f":"INDEX(Objednavka!A:I,422,4)","v":0},null,{"$f":"INDEX(Objednavka!A:I,422,5)","v":0},{"$f":"INDEX(Objednavka!A:I,422,7)","v":0},{"$f":"INDEX(Objednavka!A:I,422,8)","v":0},null,{"$f":"IF(INDEX(Objednavka!A:J,422,10)=\"\",\"\",INDEX(Objednavka!A:J,422,10))","v":""}]
[null,{"$f":"IF(INDEX(Objednavka!A:I,423,3)=\"\",INDEX(Objednavka!A:I,423,1),INDEX(Objednavka!A:I,423,3))","v":0},null,null,null,null,null,{"$f":"INDEX(Objednavka!A:I,423,4)","v":0},null,{"$f":"INDEX(Objednavka!A:I,423,5)","v":0},{"$f":"INDEX(Objednavka!A:I,423,7)","v":0},{"$f":"INDEX(Objednavka!A:I,423,8)","v":0},null,{"$f":"IF(INDEX(Objednavka!A:J,423,10)=\"\",\"\",INDEX(Objednavka!A:J,423,10))","v":""}]
[null,{"$f":"IF(INDEX(Objednavka!A:I,424,3)=\"\",INDEX(Objednavka!A:I,424,1),INDEX(Objednavka!A:I,424,3))","v":0},null,null,null,null,null,{"$f":"INDEX(Objednavka!A:I,424,4)","v":0},null,{"$f":"INDEX(Objednavka!A:I,424,5)","v":0},{"$f":"INDEX(Objednavka!A:I,424,7)","v":0},{"$f":"INDEX(Objednavka!A:I,424,8)","v":0},null,{"$f":"IF(INDEX(Objednavka!A:J,424,10)=\"\",\"\",INDEX(Objednavka!A:J,424,10))","v":""}]
[null,{"$f":"IF(INDEX(Objednavka!A:I,425,3)=\"\",INDEX(Objednavka!A:I,425,1),INDEX(Objednavka!A:I,425,3))","v":0},null,null,null,null,null,{"$f":"INDEX(Objednavka!A:I,425,4)","v":0},null,{"$f":"INDEX(Objednavka!A:I,425,5)","v":0},{"$f":"INDEX(Objednavka!A:I,425,7)","v":0},{"$f":"INDEX(Objednavka!A:I,425,8)","v":0},null,{"$f":"IF(INDEX(Objednavka!A:J,425,10)=\"\",\"\",INDEX(Objednavka!A:J,425,10))","v":""}]
[null,{"$f":"IF(INDEX(Objednavka!A:I,426,3)=\"\",INDEX(Objednavka!A:I,426,1),INDEX(Objednavka!A:I,426,3))","v":0},null,null,null,null,null,{"$f":"INDEX(Objednavka!A:I,426,4)","v":0},null,{"$f":"INDEX(Objednavka!A:I,426,5)","v":0},{"$f":"INDEX(Objednavka!A:I,426,7)","v":0},{"$f":"INDEX(Objednavka!A:I,426,8)","v":0},null,{"$f":"IF(INDEX(Objednavka!A:J,426,10)=\"\",\"\",INDEX(Objednavka!A:J,426,10))","v":""}]
[null,{"$f":"IF(INDEX(Objednavka!A:I,427,3)=\"\",INDEX(Objednavka!A:I,427,1),INDEX(Objednavka!A:I,427,3))","v":0},null,null,null,null,null,{"$f":"INDEX(Objednavka!A:I,427,4)","v":0},null,{"$f":"INDEX(Objednavka!A:I,427,5)","v":0},{"$f":"INDEX(Objednavka!A:I,427,7)","v":0},{"$f":"INDEX(Objednavka!A:I,427,8)","v":0},null,{"$f":"IF(INDEX(Objednavka!A:J,427,10)=\"\",\"\",INDEX(Objednavka!A:J,427,10))","v":""}]
[null,{"$f":"IF(INDEX(Objednavka!A:I,428,3)=\"\",INDEX(Objednavka!A:I,428,1),INDEX(Objednavka!A:I,428,3))","v":0},null,null,null,null,null,{"$f":"INDEX(Objednavka!A:I,428,4)","v":0},null,{"$f":"INDEX(Objednavka!A:I,428,5)","v":0},{"$f":"INDEX(Objednavka!A:I,428,7)","v":0},{"$f":"INDEX(Objednavka!A:I,428,8)","v":0},null,{"$f":"IF(INDEX(Objednavka!A:J,428,10)=\"\",\"\",INDEX(Objednavka!A:J,428,10))","v":""}]
[null,{"$f":"IF(INDEX(Objednavka!A:I,429,3)=\"\",INDEX(Objednavka!A:I,429,1),INDEX(Objednavka!A:I,429,3))","v":0},null,null,null,null,null,{"$f":"INDEX(Objednavka!A:I,429,4)","v":0},null,{"$f":"INDEX(Objednavka!A:I,429,5)","v":0},{"$f":"INDEX(Objednavka!A:I,429,7)","v":0},{"$f":"INDEX(Objednavka!A:I,429,8)","v":0},null,{"$f":"IF(INDEX(Objednavka!A:J,429,10)=\"\",\"\",INDEX(Objednavka!A:J,429,10))","v":""}]
[null,{"$f":"IF(INDEX(Objednavka!A:I,430,3)=\"\",INDEX(Objednavka!A:I,430,1),INDEX(Objednavka!A:I,430,3))","v":0},null,null,null,null,null,{"$f":"INDEX(Objednavka!A:I,430,4)","v":0},null,{"$f":"INDEX(Objednavka!A:I,430,5)","v":0},{"$f":"INDEX(Objednavka!A:I,430,7)","v":0},{"$f":"INDEX(Objednavka!A:I,430,8)","v":0},null,{"$f":"IF(INDEX(Objednavka!A:J,430,10)=\"\",\"\",INDEX(Objednavka!A:J,430,10))","v":""}]
[null,{"$f":"IF(INDEX(Objednavka!A:I,431,3)=\"\",INDEX(Objednavka!A:I,431,1),INDEX(Objednavka!A:I,431,3))","v":0},null,null,null,null,null,{"$f":"INDEX(Objednavka!A:I,431,4)","v":0},null,{"$f":"INDEX(Objednavka!A:I,431,5)","v":0},{"$f":"INDEX(Objednavka!A:I,431,7)","v":0},{"$f":"INDEX(Objednavka!A:I,431,8)","v":0},null,{"$f":"IF(INDEX(Objednavka!A:J,431,10)=\"\",\"\",INDEX(Objednavka!A:J,431,10))","v":""}]
[null,{"$f":"IF(INDEX(Objednavka!A:I,432,3)=\"\",INDEX(Objednavka!A:I,432,1),INDEX(Objednavka!A:I,432,3))","v":0},null,null,null,null,null,{"$f":"INDEX(Objednavka!A:I,432,4)","v":0},null,{"$f":"INDEX(Objednavka!A:I,432,5)","v":0},{"$f":"INDEX(Objednavka!A:I,432,7)","v":0},{"$f":"INDEX(Objednavka!A:I,432,8)","v":0},null,{"$f":"IF(INDEX(Objednavka!A:J,432,10)=\"\",\"\",INDEX(Objednavka!A:J,432,10))","v":""}]
[null,{"$f":"IF(INDEX(Objednavka!A:I,433,3)=\"\",INDEX(Objednavka!A:I,433,1),INDEX(Objednavka!A:I,433,3))","v":0},null,null,null,null,null,{"$f":"INDEX(Objednavka!A:I,433,4)","v":0},null,{"$f":"INDEX(Objednavka!A:I,433,5)","v":0},{"$f":"INDEX(Objednavka!A:I,433,7)","v":0},{"$f":"INDEX(Objednavka!A:I,433,8)","v":0},null,{"$f":"IF(INDEX(Objednavka!A:J,433,10)=\"\",\"\",INDEX(Objednavka!A:J,433,10))","v":""}]
[null,{"$f":"IF(INDEX(Objednavka!A:I,434,3)=\"\",INDEX(Objednavka!A:I,434,1),INDEX(Objednavka!A:I,434,3))","v":0},null,null,null,null,null,{"$f":"INDEX(Objednavka!A:I,434,4)","v":0},null,{"$f":"INDEX(Objednavka!A:I,434,5)","v":0},{"$f":"INDEX(Objednavka!A:I,434,7)","v":0},{"$f":"INDEX(Objednavka!A:I,434,8)","v":0},null,{"$f":"IF(INDEX(Objednavka!A:J,434,10)=\"\",\"\",INDEX(Objednavka!A:J,434,10))","v":""}]
[null,{"$f":"IF(INDEX(Objednavka!A:I,435,3)=\"\",INDEX(Objednavka!A:I,435,1),INDEX(Objednavka!A:I,435,3))","v":0},null,null,null,null,null,{"$f":"INDEX(Objednavka!A:I,435,4)","v":0},null,{"$f":"INDEX(Objednavka!A:I,435,5)","v":0},{"$f":"INDEX(Objednavka!A:I,435,7)","v":0},{"$f":"INDEX(Objednavka!A:I,435,8)","v":0},null,{"$f":"IF(INDEX(Objednavka!A:J,435,10)=\"\",\"\",INDEX(Objednavka!A:J,435,10))","v":""}]
[null,{"$f":"IF(INDEX(Objednavka!A:I,436,3)=\"\",INDEX(Objednavka!A:I,436,1),INDEX(Objednavka!A:I,436,3))","v":0},null,null,null,null,null,{"$f":"INDEX(Objednavka!A:I,436,4)","v":0},null,{"$f":"INDEX(Objednavka!A:I,436,5)","v":0},{"$f":"INDEX(Objednavka!A:I,436,7)","v":0},{"$f":"INDEX(Objednavka!A:I,436,8)","v":0},null,{"$f":"IF(INDEX(Objednavka!A:J,436,10)=\"\",\"\",INDEX(Objednavka!A:J,436,10))","v":""}]
[null,{"$f":"IF(INDEX(Objednavka!A:I,437,3)=\"\",INDEX(Objednavka!A:I,437,1),INDEX(Objednavka!A:I,437,3))","v":0},null,null,null,null,null,{"$f":"INDEX(Objednavka!A:I,437,4)","v":0},null,{"$f":"INDEX(Objednavka!A:I,437,5)","v":0},{"$f":"INDEX(Objednavka!A:I,437,7)","v":0},{"$f":"INDEX(Objednavka!A:I,437,8)","v":0},null,{"$f":"IF(INDEX(Objednavka!A:J,437,10)=\"\",\"\",INDEX(Objednavka!A:J,437,10))","v":""}]
[null,{"$f":"IF(INDEX(Objednavka!A:I,438,3)=\"\",INDEX(Objednavka!A:I,438,1),INDEX(Objednavka!A:I,438,3))","v":0},null,null,null,null,null,{"$f":"INDEX(Objednavka!A:I,438,4)","v":0},null,{"$f":"INDEX(Objednavka!A:I,438,5)","v":0},{"$f":"INDEX(Objednavka!A:I,438,7)","v":0},{"$f":"INDEX(Objednavka!A:I,438,8)","v":0},null,{"$f":"IF(INDEX(Objednavka!A:J,438,10)=\"\",\"\",INDEX(Objednavka!A:J,438,10))","v":""}]
[null,{"$f":"IF(INDEX(Objednavka!A:I,439,3)=\"\",INDEX(Objednavka!A:I,439,1),INDEX(Objednavka!A:I,439,3))","v":0},null,null,null,null,null,{"$f":"INDEX(Objednavka!A:I,439,4)","v":0},null,{"$f":"INDEX(Objednavka!A:I,439,5)","v":0},{"$f":"INDEX(Objednavka!A:I,439,7)","v":0},{"$f":"INDEX(Objednavka!A:I,439,8)","v":0},null,{"$f":"IF(INDEX(Objednavka!A:J,439,10)=\"\",\"\",INDEX(Objednavka!A:J,439,10))","v":""}]
[null,{"$f":"IF(INDEX(Objednavka!A:I,440,3)=\"\",INDEX(Objednavka!A:I,440,1),INDEX(Objednavka!A:I,440,3))","v":0},null,null,null,null,null,{"$f":"INDEX(Objednavka!A:I,440,4)","v":0},null,{"$f":"INDEX(Objednavka!A:I,440,5)","v":0},{"$f":"INDEX(Objednavka!A:I,440,7)","v":0},{"$f":"INDEX(Objednavka!A:I,440,8)","v":0},null,{"$f":"IF(INDEX(Objednavka!A:J,440,10)=\"\",\"\",INDEX(Objednavka!A:J,440,10))","v":""}]
[null,{"$f":"IF(INDEX(Objednavka!A:I,441,3)=\"\",INDEX(Objednavka!A:I,441,1),INDEX(Objednavka!A:I,441,3))","v":0},null,null,null,null,null,{"$f":"INDEX(Objednavka!A:I,441,4)","v":0},null,{"$f":"INDEX(Objednavka!A:I,441,5)","v":0},{"$f":"INDEX(Objednavka!A:I,441,7)","v":0},{"$f":"INDEX(Objednavka!A:I,441,8)","v":0},null,{"$f":"IF(INDEX(Objednavka!A:J,441,10)=\"\",\"\",INDEX(Objednavka!A:J,441,10))","v":""}]
[null,{"$f":"IF(INDEX(Objednavka!A:I,442,3)=\"\",INDEX(Objednavka!A:I,442,1),INDEX(Objednavka!A:I,442,3))","v":0},null,null,null,null,null,{"$f":"INDEX(Objednavka!A:I,442,4)","v":0},null,{"$f":"INDEX(Objednavka!A:I,442,5)","v":0},{"$f":"INDEX(Objednavka!A:I,442,7)","v":0},{"$f":"INDEX(Objednavka!A:I,442,8)","v":0},null,{"$f":"IF(INDEX(Objednavka!A:J,442,10)=\"\",\"\",INDEX(Objednavka!A:J,442,10))","v":""}]
[null,{"$f":"IF(INDEX(Objednavka!A:I,443,3)=\"\",INDEX(Objednavka!A:I,443,1),INDEX(Objednavka!A:I,443,3))","v":0},null,null,null,null,null,{"$f":"INDEX(Objednavka!A:I,443,4)","v":0},null,{"$f":"INDEX(Objednavka!A:I,443,5)","v":0},{"$f":"INDEX(Objednavka!A:I,443,7)","v":0},{"$f":"INDEX(Objednavka!A:I,443,8)","v":0},null,{"$f":"IF(INDEX(Objednavka!A:J,443,10)=\"\",\"\",INDEX(Objednavka!A:J,443,10))","v":""}]
[null,{"$f":"IF(INDEX(Objednavka!A:I,444,3)=\"\",INDEX(Objednavka!A:I,444,1),INDEX(Objednavka!A:I,444,3))","v":0},null,null,null,null,null,{"$f":"INDEX(Objednavka!A:I,444,4)","v":0},null,{"$f":"INDEX(Objednavka!A:I,444,5)","v":0},{"$f":"INDEX(Objednavka!A:I,444,7)","v":0},{"$f":"INDEX(Objednavka!A:I,444,8)","v":0},null,{"$f":"IF(INDEX(Objednavka!A:J,444,10)=\"\",\"\",INDEX(Objednavka!A:J,444,10))","v":""}]
[null,{"$f":"IF(INDEX(Objednavka!A:I,445,3)=\"\",INDEX(Objednavka!A:I,445,1),INDEX(Objednavka!A:I,445,3))","v":0},null,null,null,null,null,{"$f":"INDEX(Objednavka!A:I,445,4)","v":0},null,{"$f":"INDEX(Objednavka!A:I,445,5)","v":0},{"$f":"INDEX(Objednavka!A:I,445,7)","v":0},{"$f":"INDEX(Objednavka!A:I,445,8)","v":0},null,{"$f":"IF(INDEX(Objednavka!A:J,445,10)=\"\",\"\",INDEX(Objednavka!A:J,445,10))","v":""}]
[null,{"$f":"IF(INDEX(Objednavka!A:I,446,3)=\"\",INDEX(Objednavka!A:I,446,1),INDEX(Objednavka!A:I,446,3))","v":0},null,null,null,null,null,{"$f":"INDEX(Objednavka!A:I,446,4)","v":0},null,{"$f":"INDEX(Objednavka!A:I,446,5)","v":0},{"$f":"INDEX(Objednavka!A:I,446,7)","v":0},{"$f":"INDEX(Objednavka!A:I,446,8)","v":0},null,{"$f":"IF(INDEX(Objednavka!A:J,446,10)=\"\",\"\",INDEX(Objednavka!A:J,446,10))","v":""}]
[null,{"$f":"IF(INDEX(Objednavka!A:I,447,3)=\"\",INDEX(Objednavka!A:I,447,1),INDEX(Objednavka!A:I,447,3))","v":0},null,null,null,null,null,{"$f":"INDEX(Objednavka!A:I,447,4)","v":0},null,{"$f":"INDEX(Objednavka!A:I,447,5)","v":0},{"$f":"INDEX(Objednavka!A:I,447,7)","v":0},{"$f":"INDEX(Objednavka!A:I,447,8)","v":0},null,{"$f":"IF(INDEX(Objednavka!A:J,447,10)=\"\",\"\",INDEX(Objednavka!A:J,447,10))","v":""}]
[null,{"$f":"IF(INDEX(Objednavka!A:I,448,3)=\"\",INDEX(Objednavka!A:I,448,1),INDEX(Objednavka!A:I,448,3))","v":0},null,null,null,null,null,{"$f":"INDEX(Objednavka!A:I,448,4)","v":0},null,{"$f":"INDEX(Objednavka!A:I,448,5)","v":0},{"$f":"INDEX(Objednavka!A:I,448,7)","v":0},{"$f":"INDEX(Objednavka!A:I,448,8)","v":0},null,{"$f":"IF(INDEX(Objednavka!A:J,448,10)=\"\",\"\",INDEX(Objednavka!A:J,448,10))","v":""}]
[null,{"$f":"IF(INDEX(Objednavka!A:I,449,3)=\"\",INDEX(Objednavka!A:I,449,1),INDEX(Objednavka!A:I,449,3))","v":0},null,null,null,null,null,{"$f":"INDEX(Objednavka!A:I,449,4)","v":0},null,{"$f":"INDEX(Objednavka!A:I,449,5)","v":0},{"$f":"INDEX(Objednavka!A:I,449,7)","v":0},{"$f":"INDEX(Objednavka!A:I,449,8)","v":0},null,{"$f":"IF(INDEX(Objednavka!A:J,449,10)=\"\",\"\",INDEX(Objednavka!A:J,449,10))","v":""}]
[null,{"$f":"IF(INDEX(Objednavka!A:I,450,3)=\"\",INDEX(Objednavka!A:I,450,1),INDEX(Objednavka!A:I,450,3))","v":0},null,null,null,null,null,{"$f":"INDEX(Objednavka!A:I,450,4)","v":0},null,{"$f":"INDEX(Objednavka!A:I,450,5)","v":0},{"$f":"INDEX(Objednavka!A:I,450,7)","v":0},{"$f":"INDEX(Objednavka!A:I,450,8)","v":0},null,{"$f":"IF(INDEX(Objednavka!A:J,450,10)=\"\",\"\",INDEX(Objednavka!A:J,450,10))","v":""}]
[null,{"$f":"IF(INDEX(Objednavka!A:I,451,3)=\"\",INDEX(Objednavka!A:I,451,1),INDEX(Objednavka!A:I,451,3))","v":0},null,null,null,null,null,{"$f":"INDEX(Objednavka!A:I,451,4)","v":0},null,{"$f":"INDEX(Objednavka!A:I,451,5)","v":0},{"$f":"INDEX(Objednavka!A:I,451,7)","v":0},{"$f":"INDEX(Objednavka!A:I,451,8)","v":0},null,{"$f":"IF(INDEX(Objednavka!A:J,451,10)=\"\",\"\",INDEX(Objednavka!A:J,451,10))","v":""}]
[null,{"$f":"IF(INDEX(Objednavka!A:I,452,3)=\"\",INDEX(Objednavka!A:I,452,1),INDEX(Objednavka!A:I,452,3))","v":0},null,null,null,null,null,{"$f":"INDEX(Objednavka!A:I,452,4)","v":0},null,{"$f":"INDEX(Objednavka!A:I,452,5)","v":0},{"$f":"INDEX(Objednavka!A:I,452,7)","v":0},{"$f":"INDEX(Objednavka!A:I,452,8)","v":0},null,{"$f":"IF(INDEX(Objednavka!A:J,452,10)=\"\",\"\",INDEX(Objednavka!A:J,452,10))","v":""}]
[null,{"$f":"IF(INDEX(Objednavka!A:I,453,3)=\"\",INDEX(Objednavka!A:I,453,1),INDEX(Objednavka!A:I,453,3))","v":0},null,null,null,null,null,{"$f":"INDEX(Objednavka!A:I,453,4)","v":0},null,{"$f":"INDEX(Objednavka!A:I,453,5)","v":0},{"$f":"INDEX(Objednavka!A:I,453,7)","v":0},{"$f":"INDEX(Objednavka!A:I,453,8)","v":0},null,{"$f":"IF(INDEX(Objednavka!A:J,453,10)=\"\",\"\",INDEX(Objednavka!A:J,453,10))","v":""}]
[null,{"$f":"IF(INDEX(Objednavka!A:I,454,3)=\"\",INDEX(Objednavka!A:I,454,1),INDEX(Objednavka!A:I,454,3))","v":0},null,null,null,null,null,{"$f":"INDEX(Objednavka!A:I,454,4)","v":0},null,{"$f":"INDEX(Objednavka!A:I,454,5)","v":0},{"$f":"INDEX(Objednavka!A:I,454,7)","v":0},{"$f":"INDEX(Objednavka!A:I,454,8)","v":0},null,{"$f":"IF(INDEX(Objednavka!A:J,454,10)=\"\",\"\",INDEX(Objednavka!A:J,454,10))","v":""}]
[null,{"$f":"IF(INDEX(Objednavka!A:I,455,3)=\"\",INDEX(Objednavka!A:I,455,1),INDEX(Objednavka!A:I,455,3))","v":0},null,null,null,null,null,{"$f":"INDEX(Objednavka!A:I,455,4)","v":0},null,{"$f":"INDEX(Objednavka!A:I,455,5)","v":0},{"$f":"INDEX(Objednavka!A:I,455,7)","v":0},{"$f":"INDEX(Objednavka!A:I,455,8)","v":0},null,{"$f":"IF(INDEX(Objednavka!A:J,455,10)=\"\",\"\",INDEX(Objednavka!A:J,455,10))","v":""}]
[null,{"$f":"IF(INDEX(Objednavka!A:I,456,3)=\"\",INDEX(Objednavka!A:I,456,1),INDEX(Objednavka!A:I,456,3))","v":0},null,null,null,null,null,{"$f":"INDEX(Objednavka!A:I,456,4)","v":0},null,{"$f":"INDEX(Objednavka!A:I,456,5)","v":0},{"$f":"INDEX(Objednavka!A:I,456,7)","v":0},{"$f":"INDEX(Objednavka!A:I,456,8)","v":0},null,{"$f":"IF(INDEX(Objednavka!A:J,456,10)=\"\",\"\",INDEX(Objednavka!A:J,456,10))","v":""}]
[null,{"$f":"IF(INDEX(Objednavka!A:I,457,3)=\"\",INDEX(Objednavka!A:I,457,1),INDEX(Objednavka!A:I,457,3))","v":0},null,null,null,null,null,{"$f":"INDEX(Objednavka!A:I,457,4)","v":0},null,{"$f":"INDEX(Objednavka!A:I,457,5)","v":0},{"$f":"INDEX(Objednavka!A:I,457,7)","v":0},{"$f":"INDEX(Objednavka!A:I,457,8)","v":0},null,{"$f":"IF(INDEX(Objednavka!A:J,457,10)=\"\",\"\",INDEX(Objednavka!A:J,457,10))","v":""}]
[null,{"$f":"IF(INDEX(Objednavka!A:I,458,3)=\"\",INDEX(Objednavka!A:I,458,1),INDEX(Objednavka!A:I,458,3))","v":0},null,null,null,null,null,{"$f":"INDEX(Objednavka!A:I,458,4)","v":0},null,{"$f":"INDEX(Objednavka!A:I,458,5)","v":0},{"$f":"INDEX(Objednavka!A:I,458,7)","v":0},{"$f":"INDEX(Objednavka!A:I,458,8)","v":0},null,{"$f":"IF(INDEX(Objednavka!A:J,458,10)=\"\",\"\",INDEX(Objednavka!A:J,458,10))","v":""}]
[null,{"$f":"IF(INDEX(Objednavka!A:I,459,3)=\"\",INDEX(Objednavka!A:I,459,1),INDEX(Objednavka!A:I,459,3))","v":0},null,null,null,null,null,{"$f":"INDEX(Objednavka!A:I,459,4)","v":0},null,{"$f":"INDEX(Objednavka!A:I,459,5)","v":0},{"$f":"INDEX(Objednavka!A:I,459,7)","v":0},{"$f":"INDEX(Objednavka!A:I,459,8)","v":0},null,{"$f":"IF(INDEX(Objednavka!A:J,459,10)=\"\",\"\",INDEX(Objednavka!A:J,459,10))","v":""}]
[null,{"$f":"IF(INDEX(Objednavka!A:I,460,3)=\"\",INDEX(Objednavka!A:I,460,1),INDEX(Objednavka!A:I,460,3))","v":0},null,null,null,null,null,{"$f":"INDEX(Objednavka!A:I,460,4)","v":0},null,{"$f":"INDEX(Objednavka!A:I,460,5)","v":0},{"$f":"INDEX(Objednavka!A:I,460,7)","v":0},{"$f":"INDEX(Objednavka!A:I,460,8)","v":0},null,{"$f":"IF(INDEX(Objednavka!A:J,460,10)=\"\",\"\",INDEX(Objednavka!A:J,460,10))","v":""}]
[null,{"$f":"IF(INDEX(Objednavka!A:I,461,3)=\"\",INDEX(Objednavka!A:I,461,1),INDEX(Objednavka!A:I,461,3))","v":0},null,null,null,null,null,{"$f":"INDEX(Objednavka!A:I,461,4)","v":0},null,{"$f":"INDEX(Objednavka!A:I,461,5)","v":0},{"$f":"INDEX(Objednavka!A:I,461,7)","v":0},{"$f":"INDEX(Objednavka!A:I,461,8)","v":0},null,{"$f":"IF(INDEX(Objednavka!A:J,461,10)=\"\",\"\",INDEX(Objednavka!A:J,461,10))","v":""}]
[null,{"$f":"IF(INDEX(Objednavka!A:I,462,3)=\"\",INDEX(Objednavka!A:I,462,1),INDEX(Objednavka!A:I,462,3))","v":0},null,null,null,null,null,{"$f":"INDEX(Objednavka!A:I,462,4)","v":0},null,{"$f":"INDEX(Objednavka!A:I,462,5)","v":0},{"$f":"INDEX(Objednavka!A:I,462,7)","v":0},{"$f":"INDEX(Objednavka!A:I,462,8)","v":0},null,{"$f":"IF(INDEX(Objednavka!A:J,462,10)=\"\",\"\",INDEX(Objednavka!A:J,462,10))","v":""}]
[null,{"$f":"IF(INDEX(Objednavka!A:I,463,3)=\"\",INDEX(Objednavka!A:I,463,1),INDEX(Objednavka!A:I,463,3))","v":0},null,null,null,null,null,{"$f":"INDEX(Objednavka!A:I,463,4)","v":0},null,{"$f":"INDEX(Objednavka!A:I,463,5)","v":0},{"$f":"INDEX(Objednavka!A:I,463,7)","v":0},{"$f":"INDEX(Objednavka!A:I,463,8)","v":0},null,{"$f":"IF(INDEX(Objednavka!A:J,463,10)=\"\",\"\",INDEX(Objednavka!A:J,463,10))","v":""}]
[null,{"$f":"IF(INDEX(Objednavka!A:I,464,3)=\"\",INDEX(Objednavka!A:I,464,1),INDEX(Objednavka!A:I,464,3))","v":0},null,null,null,null,null,{"$f":"INDEX(Objednavka!A:I,464,4)","v":0},null,{"$f":"INDEX(Objednavka!A:I,464,5)","v":0},{"$f":"INDEX(Objednavka!A:I,464,7)","v":0},{"$f":"INDEX(Objednavka!A:I,464,8)","v":0},null,{"$f":"IF(INDEX(Objednavka!A:J,464,10)=\"\",\"\",INDEX(Objednavka!A:J,464,10))","v":""}]
[null,{"$f":"IF(INDEX(Objednavka!A:I,465,3)=\"\",INDEX(Objednavka!A:I,465,1),INDEX(Objednavka!A:I,465,3))","v":0},null,null,null,null,null,{"$f":"INDEX(Objednavka!A:I,465,4)","v":0},null,{"$f":"INDEX(Objednavka!A:I,465,5)","v":0},{"$f":"INDEX(Objednavka!A:I,465,7)","v":0},{"$f":"INDEX(Objednavka!A:I,465,8)","v":0},null,{"$f":"IF(INDEX(Objednavka!A:J,465,10)=\"\",\"\",INDEX(Objednavka!A:J,465,10))","v":""}]
[null,{"$f":"IF(INDEX(Objednavka!A:I,466,3)=\"\",INDEX(Objednavka!A:I,466,1),INDEX(Objednavka!A:I,466,3))","v":0},null,null,null,null,null,{"$f":"INDEX(Objednavka!A:I,466,4)","v":0},null,{"$f":"INDEX(Objednavka!A:I,466,5)","v":0},{"$f":"INDEX(Objednavka!A:I,466,7)","v":0},{"$f":"INDEX(Objednavka!A:I,466,8)","v":0},null,{"$f":"IF(INDEX(Objednavka!A:J,466,10)=\"\",\"\",INDEX(Objednavka!A:J,466,10))","v":""}]
[null,{"$f":"IF(INDEX(Objednavka!A:I,467,3)=\"\",INDEX(Objednavka!A:I,467,1),INDEX(Objednavka!A:I,467,3))","v":0},null,null,null,null,null,{"$f":"INDEX(Objednavka!A:I,467,4)","v":0},null,{"$f":"INDEX(Objednavka!A:I,467,5)","v":0},{"$f":"INDEX(Objednavka!A:I,467,7)","v":0},{"$f":"INDEX(Objednavka!A:I,467,8)","v":0},null,{"$f":"IF(INDEX(Objednavka!A:J,467,10)=\"\",\"\",INDEX(Objednavka!A:J,467,10))","v":""}]
[null,{"$f":"IF(INDEX(Objednavka!A:I,468,3)=\"\",INDEX(Objednavka!A:I,468,1),INDEX(Objednavka!A:I,468,3))","v":0},null,null,null,null,null,{"$f":"INDEX(Objednavka!A:I,468,4)","v":0},null,{"$f":"INDEX(Objednavka!A:I,468,5)","v":0},{"$f":"INDEX(Objednavka!A:I,468,7)","v":0},{"$f":"INDEX(Objednavka!A:I,468,8)","v":0},null,{"$f":"IF(INDEX(Objednavka!A:J,468,10)=\"\",\"\",INDEX(Objednavka!A:J,468,10))","v":""}]
[null,{"$f":"IF(INDEX(Objednavka!A:I,469,3)=\"\",INDEX(Objednavka!A:I,469,1),INDEX(Objednavka!A:I,469,3))","v":0},null,null,null,null,null,{"$f":"INDEX(Objednavka!A:I,469,4)","v":0},null,{"$f":"INDEX(Objednavka!A:I,469,5)","v":0},{"$f":"INDEX(Objednavka!A:I,469,7)","v":0},{"$f":"INDEX(Objednavka!A:I,469,8)","v":0},null,{"$f":"IF(INDEX(Objednavka!A:J,469,10)=\"\",\"\",INDEX(Objednavka!A:J,469,10))","v":""}]
[null,{"$f":"IF(INDEX(Objednavka!A:I,470,3)=\"\",INDEX(Objednavka!A:I,470,1),INDEX(Objednavka!A:I,470,3))","v":0},null,null,null,null,null,{"$f":"INDEX(Objednavka!A:I,470,4)","v":0},null,{"$f":"INDEX(Objednavka!A:I,470,5)","v":0},{"$f":"INDEX(Objednavka!A:I,470,7)","v":0},{"$f":"INDEX(Objednavka!A:I,470,8)","v":0},null,{"$f":"IF(INDEX(Objednavka!A:J,470,10)=\"\",\"\",INDEX(Objednavka!A:J,470,10))","v":""}]
[null,{"$f":"IF(INDEX(Objednavka!A:I,471,3)=\"\",INDEX(Objednavka!A:I,471,1),INDEX(Objednavka!A:I,471,3))","v":0},null,null,null,null,null,{"$f":"INDEX(Objednavka!A:I,471,4)","v":0},null,{"$f":"INDEX(Objednavka!A:I,471,5)","v":0},{"$f":"INDEX(Objednavka!A:I,471,7)","v":0},{"$f":"INDEX(Objednavka!A:I,471,8)","v":0},null,{"$f":"IF(INDEX(Objednavka!A:J,471,10)=\"\",\"\",INDEX(Objednavka!A:J,471,10))","v":""}]
[null,{"$f":"IF(INDEX(Objednavka!A:I,472,3)=\"\",INDEX(Objednavka!A:I,472,1),INDEX(Objednavka!A:I,472,3))","v":0},null,null,null,null,null,{"$f":"INDEX(Objednavka!A:I,472,4)","v":0},null,{"$f":"INDEX(Objednavka!A:I,472,5)","v":0},{"$f":"INDEX(Objednavka!A:I,472,7)","v":0},{"$f":"INDEX(Objednavka!A:I,472,8)","v":0},null,{"$f":"IF(INDEX(Objednavka!A:J,472,10)=\"\",\"\",INDEX(Objednavka!A:J,472,10))","v":""}]
[null,{"$f":"IF(INDEX(Objednavka!A:I,473,3)=\"\",INDEX(Objednavka!A:I,473,1),INDEX(Objednavka!A:I,473,3))","v":0},null,null,null,null,null,{"$f":"INDEX(Objednavka!A:I,473,4)","v":0},null,{"$f":"INDEX(Objednavka!A:I,473,5)","v":0},{"$f":"INDEX(Objednavka!A:I,473,7)","v":0},{"$f":"INDEX(Objednavka!A:I,473,8)","v":0},null,{"$f":"IF(INDEX(Objednavka!A:J,473,10)=\"\",\"\",INDEX(Objednavka!A:J,473,10))","v":""}]
[null,{"$f":"IF(INDEX(Objednavka!A:I,474,3)=\"\",INDEX(Objednavka!A:I,474,1),INDEX(Objednavka!A:I,474,3))","v":0},null,null,null,null,null,{"$f":"INDEX(Objednavka!A:I,474,4)","v":0},null,{"$f":"INDEX(Objednavka!A:I,474,5)","v":0},{"$f":"INDEX(Objednavka!A:I,474,7)","v":0},{"$f":"INDEX(Objednavka!A:I,474,8)","v":0},null,{"$f":"IF(INDEX(Objednavka!A:J,474,10)=\"\",\"\",INDEX(Objednavka!A:J,474,10))","v":""}]
[null,{"$f":"IF(INDEX(Objednavka!A:I,475,3)=\"\",INDEX(Objednavka!A:I,475,1),INDEX(Objednavka!A:I,475,3))","v":0},null,null,null,null,null,{"$f":"INDEX(Objednavka!A:I,475,4)","v":0},null,{"$f":"INDEX(Objednavka!A:I,475,5)","v":0},{"$f":"INDEX(Objednavka!A:I,475,7)","v":0},{"$f":"INDEX(Objednavka!A:I,475,8)","v":0},null,{"$f":"IF(INDEX(Objednavka!A:J,475,10)=\"\",\"\",INDEX(Objednavka!A:J,475,10))","v":""}]
[null,{"$f":"IF(INDEX(Objednavka!A:I,476,3)=\"\",INDEX(Objednavka!A:I,476,1),INDEX(Objednavka!A:I,476,3))","v":0},null,null,null,null,null,{"$f":"INDEX(Objednavka!A:I,476,4)","v":0},null,{"$f":"INDEX(Objednavka!A:I,476,5)","v":0},{"$f":"INDEX(Objednavka!A:I,476,7)","v":0},{"$f":"INDEX(Objednavka!A:I,476,8)","v":0},null,{"$f":"IF(INDEX(Objednavka!A:J,476,10)=\"\",\"\",INDEX(Objednavka!A:J,476,10))","v":""}]
[null,{"$f":"IF(INDEX(Objednavka!A:I,477,3)=\"\",INDEX(Objednavka!A:I,477,1),INDEX(Objednavka!A:I,477,3))","v":0},null,null,null,null,null,{"$f":"INDEX(Objednavka!A:I,477,4)","v":0},null,{"$f":"INDEX(Objednavka!A:I,477,5)","v":0},{"$f":"INDEX(Objednavka!A:I,477,7)","v":0},{"$f":"INDEX(Objednavka!A:I,477,8)","v":0},null,{"$f":"IF(INDEX(Objednavka!A:J,477,10)=\"\",\"\",INDEX(Objednavka!A:J,477,10))","v":""}]
[null,{"$f":"IF(INDEX(Objednavka!A:I,478,3)=\"\",INDEX(Objednavka!A:I,478,1),INDEX(Objednavka!A:I,478,3))","v":0},null,null,null,null,null,{"$f":"INDEX(Objednavka!A:I,478,4)","v":0},null,{"$f":"INDEX(Objednavka!A:I,478,5)","v":0},{"$f":"INDEX(Objednavka!A:I,478,7)","v":0},{"$f":"INDEX(Objednavka!A:I,478,8)","v":0},null,{"$f":"IF(INDEX(Objednavka!A:J,478,10)=\"\",\"\",INDEX(Objednavka!A:J,478,10))","v":""}]
[null,{"$f":"IF(INDEX(Objednavka!A:I,479,3)=\"\",INDEX(Objednavka!A:I,479,1),INDEX(Objednavka!A:I,479,3))","v":0},null,null,null,null,null,{"$f":"INDEX(Objednavka!A:I,479,4)","v":0},null,{"$f":"INDEX(Objednavka!A:I,479,5)","v":0},{"$f":"INDEX(Objednavka!A:I,479,7)","v":0},{"$f":"INDEX(Objednavka!A:I,479,8)","v":0},null,{"$f":"IF(INDEX(Objednavka!A:J,479,10)=\"\",\"\",INDEX(Objednavka!A:J,479,10))","v":""}]
[null,{"$f":"IF(INDEX(Objednavka!A:I,480,3)=\"\",INDEX(Objednavka!A:I,480,1),INDEX(Objednavka!A:I,480,3))","v":0},null,null,null,null,null,{"$f":"INDEX(Objednavka!A:I,480,4)","v":0},null,{"$f":"INDEX(Objednavka!A:I,480,5)","v":0},{"$f":"INDEX(Objednavka!A:I,480,7)","v":0},{"$f":"INDEX(Objednavka!A:I,480,8)","v":0},null,{"$f":"IF(INDEX(Objednavka!A:J,480,10)=\"\",\"\",INDEX(Objednavka!A:J,480,10))","v":""}]
[null,{"$f":"IF(INDEX(Objednavka!A:I,481,3)=\"\",INDEX(Objednavka!A:I,481,1),INDEX(Objednavka!A:I,481,3))","v":0},null,null,null,null,null,{"$f":"INDEX(Objednavka!A:I,481,4)","v":0},null,{"$f":"INDEX(Objednavka!A:I,481,5)","v":0},{"$f":"INDEX(Objednavka!A:I,481,7)","v":0},{"$f":"INDEX(Objednavka!A:I,481,8)","v":0},null,{"$f":"IF(INDEX(Objednavka!A:J,481,10)=\"\",\"\",INDEX(Objednavka!A:J,481,10))","v":""}]
[null,{"$f":"IF(INDEX(Objednavka!A:I,482,3)=\"\",INDEX(Objednavka!A:I,482,1),INDEX(Objednavka!A:I,482,3))","v":0},null,null,null,null,null,{"$f":"INDEX(Objednavka!A:I,482,4)","v":0},null,{"$f":"INDEX(Objednavka!A:I,482,5)","v":0},{"$f":"INDEX(Objednavka!A:I,482,7)","v":0},{"$f":"INDEX(Objednavka!A:I,482,8)","v":0},null,{"$f":"IF(INDEX(Objednavka!A:J,482,10)=\"\",\"\",INDEX(Objednavka!A:J,482,10))","v":""}]
[null,{"$f":"IF(INDEX(Objednavka!A:I,483,3)=\"\",INDEX(Objednavka!A:I,483,1),INDEX(Objednavka!A:I,483,3))","v":0},null,null,null,null,null,{"$f":"INDEX(Objednavka!A:I,483,4)","v":0},null,{"$f":"INDEX(Objednavka!A:I,483,5)","v":0},{"$f":"INDEX(Objednavka!A:I,483,7)","v":0},{"$f":"INDEX(Objednavka!A:I,483,8)","v":0},null,{"$f":"IF(INDEX(Objednavka!A:J,483,10)=\"\",\"\",INDEX(Objednavka!A:J,483,10))","v":""}]
[null,{"$f":"IF(INDEX(Objednavka!A:I,484,3)=\"\",INDEX(Objednavka!A:I,484,1),INDEX(Objednavka!A:I,484,3))","v":0},null,null,null,null,null,{"$f":"INDEX(Objednavka!A:I,484,4)","v":0},null,{"$f":"INDEX(Objednavka!A:I,484,5)","v":0},{"$f":"INDEX(Objednavka!A:I,484,7)","v":0},{"$f":"INDEX(Objednavka!A:I,484,8)","v":0},null,{"$f":"IF(INDEX(Objednavka!A:J,484,10)=\"\",\"\",INDEX(Objednavka!A:J,484,10))","v":""}]
[null,{"$f":"IF(INDEX(Objednavka!A:I,485,3)=\"\",INDEX(Objednavka!A:I,485,1),INDEX(Objednavka!A:I,485,3))","v":0},null,null,null,null,null,{"$f":"INDEX(Objednavka!A:I,485,4)","v":0},null,{"$f":"INDEX(Objednavka!A:I,485,5)","v":0},{"$f":"INDEX(Objednavka!A:I,485,7)","v":0},{"$f":"INDEX(Objednavka!A:I,485,8)","v":0},null,{"$f":"IF(INDEX(Objednavka!A:J,485,10)=\"\",\"\",INDEX(Objednavka!A:J,485,10))","v":""}]
[null,{"$f":"IF(INDEX(Objednavka!A:I,486,3)=\"\",INDEX(Objednavka!A:I,486,1),INDEX(Objednavka!A:I,486,3))","v":0},null,null,null,null,null,{"$f":"INDEX(Objednavka!A:I,486,4)","v":0},null,{"$f":"INDEX(Objednavka!A:I,486,5)","v":0},{"$f":"INDEX(Objednavka!A:I,486,7)","v":0},{"$f":"INDEX(Objednavka!A:I,486,8)","v":0},null,{"$f":"IF(INDEX(Objednavka!A:J,486,10)=\"\",\"\",INDEX(Objednavka!A:J,486,10))","v":""}]
[null,{"$f":"IF(INDEX(Objednavka!A:I,487,3)=\"\",INDEX(Objednavka!A:I,487,1),INDEX(Objednavka!A:I,487,3))","v":0},null,null,null,null,null,{"$f":"INDEX(Objednavka!A:I,487,4)","v":0},null,{"$f":"INDEX(Objednavka!A:I,487,5)","v":0},{"$f":"INDEX(Objednavka!A:I,487,7)","v":0},{"$f":"INDEX(Objednavka!A:I,487,8)","v":0},null,{"$f":"IF(INDEX(Objednavka!A:J,487,10)=\"\",\"\",INDEX(Objednavka!A:J,487,10))","v":""}]
[null,{"$f":"IF(INDEX(Objednavka!A:I,488,3)=\"\",INDEX(Objednavka!A:I,488,1),INDEX(Objednavka!A:I,488,3))","v":0},null,null,null,null,null,{"$f":"INDEX(Objednavka!A:I,488,4)","v":0},null,{"$f":"INDEX(Objednavka!A:I,488,5)","v":0},{"$f":"INDEX(Objednavka!A:I,488,7)","v":0},{"$f":"INDEX(Objednavka!A:I,488,8)","v":0},null,{"$f":"IF(INDEX(Objednavka!A:J,488,10)=\"\",\"\",INDEX(Objednavka!A:J,488,10))","v":""}]
[null,{"$f":"IF(INDEX(Objednavka!A:I,489,3)=\"\",INDEX(Objednavka!A:I,489,1),INDEX(Objednavka!A:I,489,3))","v":0},null,null,null,null,null,{"$f":"INDEX(Objednavka!A:I,489,4)","v":0},null,{"$f":"INDEX(Objednavka!A:I,489,5)","v":0},{"$f":"INDEX(Objednavka!A:I,489,7)","v":0},{"$f":"INDEX(Objednavka!A:I,489,8)","v":0},null,{"$f":"IF(INDEX(Objednavka!A:J,489,10)=\"\",\"\",INDEX(Objednavka!A:J,489,10))","v":""}]
[null,{"$f":"IF(INDEX(Objednavka!A:I,490,3)=\"\",INDEX(Objednavka!A:I,490,1),INDEX(Objednavka!A:I,490,3))","v":0},null,null,null,null,null,{"$f":"INDEX(Objednavka!A:I,490,4)","v":0},null,{"$f":"INDEX(Objednavka!A:I,490,5)","v":0},{"$f":"INDEX(Objednavka!A:I,490,7)","v":0},{"$f":"INDEX(Objednavka!A:I,490,8)","v":0},null,{"$f":"IF(INDEX(Objednavka!A:J,490,10)=\"\",\"\",INDEX(Objednavka!A:J,490,10))","v":""}]
[null,{"$f":"IF(INDEX(Objednavka!A:I,491,3)=\"\",INDEX(Objednavka!A:I,491,1),INDEX(Objednavka!A:I,491,3))","v":0},null,null,null,null,null,{"$f":"INDEX(Objednavka!A:I,491,4)","v":0},null,{"$f":"INDEX(Objednavka!A:I,491,5)","v":0},{"$f":"INDEX(Objednavka!A:I,491,7)","v":0},{"$f":"INDEX(Objednavka!A:I,491,8)","v":0},null,{"$f":"IF(INDEX(Objednavka!A:J,491,10)=\"\",\"\",INDEX(Objednavka!A:J,491,10))","v":""}]
[null,{"$f":"IF(INDEX(Objednavka!A:I,492,3)=\"\",INDEX(Objednavka!A:I,492,1),INDEX(Objednavka!A:I,492,3))","v":0},null,null,null,null,null,{"$f":"INDEX(Objednavka!A:I,492,4)","v":0},null,{"$f":"INDEX(Objednavka!A:I,492,5)","v":0},{"$f":"INDEX(Objednavka!A:I,492,7)","v":0},{"$f":"INDEX(Objednavka!A:I,492,8)","v":0},null,{"$f":"IF(INDEX(Objednavka!A:J,492,10)=\"\",\"\",INDEX(Objednavka!A:J,492,10))","v":""}]
[null,{"$f":"IF(INDEX(Objednavka!A:I,493,3)=\"\",INDEX(Objednavka!A:I,493,1),INDEX(Objednavka!A:I,493,3))","v":0},null,null,null,null,null,{"$f":"INDEX(Objednavka!A:I,493,4)","v":0},null,{"$f":"INDEX(Objednavka!A:I,493,5)","v":0},{"$f":"INDEX(Objednavka!A:I,493,7)","v":0},{"$f":"INDEX(Objednavka!A:I,493,8)","v":0},null,{"$f":"IF(INDEX(Objednavka!A:J,493,10)=\"\",\"\",INDEX(Objednavka!A:J,493,10))","v":""}]
[null,{"$f":"IF(INDEX(Objednavka!A:I,494,3)=\"\",INDEX(Objednavka!A:I,494,1),INDEX(Objednavka!A:I,494,3))","v":0},null,null,null,null,null,{"$f":"INDEX(Objednavka!A:I,494,4)","v":0},null,{"$f":"INDEX(Objednavka!A:I,494,5)","v":0},{"$f":"INDEX(Objednavka!A:I,494,7)","v":0},{"$f":"INDEX(Objednavka!A:I,494,8)","v":0},null,{"$f":"IF(INDEX(Objednavka!A:J,494,10)=\"\",\"\",INDEX(Objednavka!A:J,494,10))","v":""}]
[null,{"$f":"IF(INDEX(Objednavka!A:I,495,3)=\"\",INDEX(Objednavka!A:I,495,1),INDEX(Objednavka!A:I,495,3))","v":0},null,null,null,null,null,{"$f":"INDEX(Objednavka!A:I,495,4)","v":0},null,{"$f":"INDEX(Objednavka!A:I,495,5)","v":0},{"$f":"INDEX(Objednavka!A:I,495,7)","v":0},{"$f":"INDEX(Objednavka!A:I,495,8)","v":0},null,{"$f":"IF(INDEX(Objednavka!A:J,495,10)=\"\",\"\",INDEX(Objednavka!A:J,495,10))","v":""}]
[null,{"$f":"IF(INDEX(Objednavka!A:I,496,3)=\"\",INDEX(Objednavka!A:I,496,1),INDEX(Objednavka!A:I,496,3))","v":0},null,null,null,null,null,{"$f":"INDEX(Objednavka!A:I,496,4)","v":0},null,{"$f":"INDEX(Objednavka!A:I,496,5)","v":0},{"$f":"INDEX(Objednavka!A:I,496,7)","v":0},{"$f":"INDEX(Objednavka!A:I,496,8)","v":0},null,{"$f":"IF(INDEX(Objednavka!A:J,496,10)=\"\",\"\",INDEX(Objednavka!A:J,496,10))","v":""}]
[null,{"$f":"IF(INDEX(Objednavka!A:I,497,3)=\"\",INDEX(Objednavka!A:I,497,1),INDEX(Objednavka!A:I,497,3))","v":0},null,null,null,null,null,{"$f":"INDEX(Objednavka!A:I,497,4)","v":0},null,{"$f":"INDEX(Objednavka!A:I,497,5)","v":0},{"$f":"INDEX(Objednavka!A:I,497,7)","v":0},{"$f":"INDEX(Objednavka!A:I,497,8)","v":0},null,{"$f":"IF(INDEX(Objednavka!A:J,497,10)=\"\",\"\",INDEX(Objednavka!A:J,497,10))","v":""}]
[null,{"$f":"IF(INDEX(Objednavka!A:I,498,3)=\"\",INDEX(Objednavka!A:I,498,1),INDEX(Objednavka!A:I,498,3))","v":0},null,null,null,null,null,{"$f":"INDEX(Objednavka!A:I,498,4)","v":0},null,{"$f":"INDEX(Objednavka!A:I,498,5)","v":0},{"$f":"INDEX(Objednavka!A:I,498,7)","v":0},{"$f":"INDEX(Objednavka!A:I,498,8)","v":0},null,{"$f":"IF(INDEX(Objednavka!A:J,498,10)=\"\",\"\",INDEX(Objednavka!A:J,498,10))","v":""}]
[null,{"$f":"IF(INDEX(Objednavka!A:I,499,3)=\"\",INDEX(Objednavka!A:I,499,1),INDEX(Objednavka!A:I,499,3))","v":0},null,null,null,null,null,{"$f":"INDEX(Objednavka!A:I,499,4)","v":0},null,{"$f":"INDEX(Objednavka!A:I,499,5)","v":0},{"$f":"INDEX(Objednavka!A:I,499,7)","v":0},{"$f":"INDEX(Objednavka!A:I,499,8)","v":0},null,{"$f":"IF(INDEX(Objednavka!A:J,499,10)=\"\",\"\",INDEX(Objednavka!A:J,499,10))","v":""}]
[null,{"$f":"IF(INDEX(Objednavka!A:I,500,3)=\"\",INDEX(Objednavka!A:I,500,1),INDEX(Objednavka!A:I,500,3))","v":0},null,null,null,null,null,{"$f":"INDEX(Objednavka!A:I,500,4)","v":0},null,{"$f":"INDEX(Objednavka!A:I,500,5)","v":0},{"$f":"INDEX(Objednavka!A:I,500,7)","v":0},{"$f":"INDEX(Objednavka!A:I,500,8)","v":0},null,{"$f":"IF(INDEX(Objednavka!A:J,500,10)=\"\",\"\",INDEX(Objednavka!A:J,500,10))","v":""}]
[null,{"$f":"IF(INDEX(Objednavka!A:I,501,3)=\"\",INDEX(Objednavka!A:I,501,1),INDEX(Objednavka!A:I,501,3))","v":0},null,null,null,null,null,{"$f":"INDEX(Objednavka!A:I,501,4)","v":0},null,{"$f":"INDEX(Objednavka!A:I,501,5)","v":0},{"$f":"INDEX(Objednavka!A:I,501,7)","v":0},{"$f":"INDEX(Objednavka!A:I,501,8)","v":0},null,{"$f":"IF(INDEX(Objednavka!A:J,501,10)=\"\",\"\",INDEX(Objednavka!A:J,501,10))","v":""}]
[null,{"$f":"IF(INDEX(Objednavka!A:I,502,3)=\"\",INDEX(Objednavka!A:I,502,1),INDEX(Objednavka!A:I,502,3))","v":0},null,null,null,null,null,{"$f":"INDEX(Objednavka!A:I,502,4)","v":0},null,{"$f":"INDEX(Objednavka!A:I,502,5)","v":0},{"$f":"INDEX(Objednavka!A:I,502,7)","v":0},{"$f":"INDEX(Objednavka!A:I,502,8)","v":0},null,{"$f":"IF(INDEX(Objednavka!A:J,502,10)=\"\",\"\",INDEX(Objednavka!A:J,502,10))","v":""}]
[null,{"$f":"IF(INDEX(Objednavka!A:I,503,3)=\"\",INDEX(Objednavka!A:I,503,1),INDEX(Objednavka!A:I,503,3))","v":0},null,null,null,null,null,{"$f":"INDEX(Objednavka!A:I,503,4)","v":0},null,{"$f":"INDEX(Objednavka!A:I,503,5)","v":0},{"$f":"INDEX(Objednavka!A:I,503,7)","v":0},{"$f":"INDEX(Objednavka!A:I,503,8)","v":0},null,{"$f":"IF(INDEX(Objednavka!A:J,503,10)=\"\",\"\",INDEX(Objednavka!A:J,503,10))","v":""}]
[null,{"$f":"IF(INDEX(Objednavka!A:I,504,3)=\"\",INDEX(Objednavka!A:I,504,1),INDEX(Objednavka!A:I,504,3))","v":0},null,null,null,null,null,{"$f":"INDEX(Objednavka!A:I,504,4)","v":0},null,{"$f":"INDEX(Objednavka!A:I,504,5)","v":0},{"$f":"INDEX(Objednavka!A:I,504,7)","v":0},{"$f":"INDEX(Objednavka!A:I,504,8)","v":0},null,{"$f":"IF(INDEX(Objednavka!A:J,504,10)=\"\",\"\",INDEX(Objednavka!A:J,504,10))","v":""}]
[null,{"$f":"IF(INDEX(Objednavka!A:I,505,3)=\"\",INDEX(Objednavka!A:I,505,1),INDEX(Objednavka!A:I,505,3))","v":0},null,null,null,null,null,{"$f":"INDEX(Objednavka!A:I,505,4)","v":0},null,{"$f":"INDEX(Objednavka!A:I,505,5)","v":0},{"$f":"INDEX(Objednavka!A:I,505,7)","v":0},{"$f":"INDEX(Objednavka!A:I,505,8)","v":0},null,{"$f":"IF(INDEX(Objednavka!A:J,505,10)=\"\",\"\",INDEX(Objednavka!A:J,505,10))","v":""}]
[null,{"$f":"IF(INDEX(Objednavka!A:I,506,3)=\"\",INDEX(Objednavka!A:I,506,1),INDEX(Objednavka!A:I,506,3))","v":0},null,null,null,null,null,{"$f":"INDEX(Objednavka!A:I,506,4)","v":0},null,{"$f":"INDEX(Objednavka!A:I,506,5)","v":0},{"$f":"INDEX(Objednavka!A:I,506,7)","v":0},{"$f":"INDEX(Objednavka!A:I,506,8)","v":0},null,{"$f":"IF(INDEX(Objednavka!A:J,506,10)=\"\",\"\",INDEX(Objednavka!A:J,506,10))","v":""}]
[null,{"$f":"IF(INDEX(Objednavka!A:I,507,3)=\"\",INDEX(Objednavka!A:I,507,1),INDEX(Objednavka!A:I,507,3))","v":0},null,null,null,null,null,{"$f":"INDEX(Objednavka!A:I,507,4)","v":0},null,{"$f":"INDEX(Objednavka!A:I,507,5)","v":0},{"$f":"INDEX(Objednavka!A:I,507,7)","v":0},{"$f":"INDEX(Objednavka!A:I,507,8)","v":0},null,{"$f":"IF(INDEX(Objednavka!A:J,507,10)=\"\",\"\",INDEX(Objednavka!A:J,507,10))","v":""}]
[null,{"$f":"IF(INDEX(Objednavka!A:I,508,3)=\"\",INDEX(Objednavka!A:I,508,1),INDEX(Objednavka!A:I,508,3))","v":0},null,null,null,null,null,{"$f":"INDEX(Objednavka!A:I,508,4)","v":0},null,{"$f":"INDEX(Objednavka!A:I,508,5)","v":0},{"$f":"INDEX(Objednavka!A:I,508,7)","v":0},{"$f":"INDEX(Objednavka!A:I,508,8)","v":0},null,{"$f":"IF(INDEX(Objednavka!A:J,508,10)=\"\",\"\",INDEX(Objednavka!A:J,508,10))","v":""}]
[null,{"$f":"IF(INDEX(Objednavka!A:I,509,3)=\"\",INDEX(Objednavka!A:I,509,1),INDEX(Objednavka!A:I,509,3))","v":0},null,null,null,null,null,{"$f":"INDEX(Objednavka!A:I,509,4)","v":0},null,{"$f":"INDEX(Objednavka!A:I,509,5)","v":0},{"$f":"INDEX(Objednavka!A:I,509,7)","v":0},{"$f":"INDEX(Objednavka!A:I,509,8)","v":0},null,{"$f":"IF(INDEX(Objednavka!A:J,509,10)=\"\",\"\",INDEX(Objednavka!A:J,509,10))","v":""}]
[null,{"$f":"IF(INDEX(Objednavka!A:I,510,3)=\"\",INDEX(Objednavka!A:I,510,1),INDEX(Objednavka!A:I,510,3))","v":0},null,null,null,null,null,{"$f":"INDEX(Objednavka!A:I,510,4)","v":0},null,{"$f":"INDEX(Objednavka!A:I,510,5)","v":0},{"$f":"INDEX(Objednavka!A:I,510,7)","v":0},{"$f":"INDEX(Objednavka!A:I,510,8)","v":0},null,{"$f":"IF(INDEX(Objednavka!A:J,510,10)=\"\",\"\",INDEX(Objednavka!A:J,510,10))","v":""}]
[null,{"$f":"IF(INDEX(Objednavka!A:I,511,3)=\"\",INDEX(Objednavka!A:I,511,1),INDEX(Objednavka!A:I,511,3))","v":0},null,null,null,null,null,{"$f":"INDEX(Objednavka!A:I,511,4)","v":0},null,{"$f":"INDEX(Objednavka!A:I,511,5)","v":0},{"$f":"INDEX(Objednavka!A:I,511,7)","v":0},{"$f":"INDEX(Objednavka!A:I,511,8)","v":0},null,{"$f":"IF(INDEX(Objednavka!A:J,511,10)=\"\",\"\",INDEX(Objednavka!A:J,511,10))","v":""}]
[null,{"$f":"IF(INDEX(Objednavka!A:I,512,3)=\"\",INDEX(Objednavka!A:I,512,1),INDEX(Objednavka!A:I,512,3))","v":0},null,null,null,null,null,{"$f":"INDEX(Objednavka!A:I,512,4)","v":0},null,{"$f":"INDEX(Objednavka!A:I,512,5)","v":0},{"$f":"INDEX(Objednavka!A:I,512,7)","v":0},{"$f":"INDEX(Objednavka!A:I,512,8)","v":0},null,{"$f":"IF(INDEX(Objednavka!A:J,512,10)=\"\",\"\",INDEX(Objednavka!A:J,512,10))","v":""}]
[null,{"$f":"IF(INDEX(Objednavka!A:I,513,3)=\"\",INDEX(Objednavka!A:I,513,1),INDEX(Objednavka!A:I,513,3))","v":0},null,null,null,null,null,{"$f":"INDEX(Objednavka!A:I,513,4)","v":0},null,{"$f":"INDEX(Objednavka!A:I,513,5)","v":0},{"$f":"INDEX(Objednavka!A:I,513,7)","v":0},{"$f":"INDEX(Objednavka!A:I,513,8)","v":0},null,{"$f":"IF(INDEX(Objednavka!A:J,513,10)=\"\",\"\",INDEX(Objednavka!A:J,513,10))","v":""}]
[null,{"$f":"IF(INDEX(Objednavka!A:I,514,3)=\"\",INDEX(Objednavka!A:I,514,1),INDEX(Objednavka!A:I,514,3))","v":0},null,null,null,null,null,{"$f":"INDEX(Objednavka!A:I,514,4)","v":0},null,{"$f":"INDEX(Objednavka!A:I,514,5)","v":0},{"$f":"INDEX(Objednavka!A:I,514,7)","v":0},{"$f":"INDEX(Objednavka!A:I,514,8)","v":0},null,{"$f":"IF(INDEX(Objednavka!A:J,514,10)=\"\",\"\",INDEX(Objednavka!A:J,514,10))","v":""}]
[null,{"$f":"IF(INDEX(Objednavka!A:I,515,3)=\"\",INDEX(Objednavka!A:I,515,1),INDEX(Objednavka!A:I,515,3))","v":0},null,null,null,null,null,{"$f":"INDEX(Objednavka!A:I,515,4)","v":0},null,{"$f":"INDEX(Objednavka!A:I,515,5)","v":0},{"$f":"INDEX(Objednavka!A:I,515,7)","v":0},{"$f":"INDEX(Objednavka!A:I,515,8)","v":0},null,{"$f":"IF(INDEX(Objednavka!A:J,515,10)=\"\",\"\",INDEX(Objednavka!A:J,515,10))","v":""}]
[null,{"$f":"IF(INDEX(Objednavka!A:I,516,3)=\"\",INDEX(Objednavka!A:I,516,1),INDEX(Objednavka!A:I,516,3))","v":0},null,null,null,null,null,{"$f":"INDEX(Objednavka!A:I,516,4)","v":0},null,{"$f":"INDEX(Objednavka!A:I,516,5)","v":0},{"$f":"INDEX(Objednavka!A:I,516,7)","v":0},{"$f":"INDEX(Objednavka!A:I,516,8)","v":0},null,{"$f":"IF(INDEX(Objednavka!A:J,516,10)=\"\",\"\",INDEX(Objednavka!A:J,516,10))","v":""}]
[null,{"$f":"IF(INDEX(Objednavka!A:I,517,3)=\"\",INDEX(Objednavka!A:I,517,1),INDEX(Objednavka!A:I,517,3))","v":0},null,null,null,null,null,{"$f":"INDEX(Objednavka!A:I,517,4)","v":0},null,{"$f":"INDEX(Objednavka!A:I,517,5)","v":0},{"$f":"INDEX(Objednavka!A:I,517,7)","v":0},{"$f":"INDEX(Objednavka!A:I,517,8)","v":0},null,{"$f":"IF(INDEX(Objednavka!A:J,517,10)=\"\",\"\",INDEX(Objednavka!A:J,517,10))","v":""}]
[null,{"$f":"IF(INDEX(Objednavka!A:I,518,3)=\"\",INDEX(Objednavka!A:I,518,1),INDEX(Objednavka!A:I,518,3))","v":0},null,null,null,null,null,{"$f":"INDEX(Objednavka!A:I,518,4)","v":0},null,{"$f":"INDEX(Objednavka!A:I,518,5)","v":0},{"$f":"INDEX(Objednavka!A:I,518,7)","v":0},{"$f":"INDEX(Objednavka!A:I,518,8)","v":0},null,{"$f":"IF(INDEX(Objednavka!A:J,518,10)=\"\",\"\",INDEX(Objednavka!A:J,518,10))","v":""}]
[null,{"$f":"IF(INDEX(Objednavka!A:I,519,3)=\"\",INDEX(Objednavka!A:I,519,1),INDEX(Objednavka!A:I,519,3))","v":0},null,null,null,null,null,{"$f":"INDEX(Objednavka!A:I,519,4)","v":0},null,{"$f":"INDEX(Objednavka!A:I,519,5)","v":0},{"$f":"INDEX(Objednavka!A:I,519,7)","v":0},{"$f":"INDEX(Objednavka!A:I,519,8)","v":0},null,{"$f":"IF(INDEX(Objednavka!A:J,519,10)=\"\",\"\",INDEX(Objednavka!A:J,519,10))","v":""}]
[null,{"$f":"IF(INDEX(Objednavka!A:I,520,3)=\"\",INDEX(Objednavka!A:I,520,1),INDEX(Objednavka!A:I,520,3))","v":0},null,null,null,null,null,{"$f":"INDEX(Objednavka!A:I,520,4)","v":0},null,{"$f":"INDEX(Objednavka!A:I,520,5)","v":0},{"$f":"INDEX(Objednavka!A:I,520,7)","v":0},{"$f":"INDEX(Objednavka!A:I,520,8)","v":0},null,{"$f":"IF(INDEX(Objednavka!A:J,520,10)=\"\",\"\",INDEX(Objednavka!A:J,520,10))","v":""}]
[null,{"$f":"IF(INDEX(Objednavka!A:I,521,3)=\"\",INDEX(Objednavka!A:I,521,1),INDEX(Objednavka!A:I,521,3))","v":0},null,null,null,null,null,{"$f":"INDEX(Objednavka!A:I,521,4)","v":0},null,{"$f":"INDEX(Objednavka!A:I,521,5)","v":0},{"$f":"INDEX(Objednavka!A:I,521,7)","v":0},{"$f":"INDEX(Objednavka!A:I,521,8)","v":0},null,{"$f":"IF(INDEX(Objednavka!A:J,521,10)=\"\",\"\",INDEX(Objednavka!A:J,521,10))","v":""}]
[null,{"$f":"IF(INDEX(Objednavka!A:I,522,3)=\"\",INDEX(Objednavka!A:I,522,1),INDEX(Objednavka!A:I,522,3))","v":0},null,null,null,null,null,{"$f":"INDEX(Objednavka!A:I,522,4)","v":0},null,{"$f":"INDEX(Objednavka!A:I,522,5)","v":0},{"$f":"INDEX(Objednavka!A:I,522,7)","v":0},{"$f":"INDEX(Objednavka!A:I,522,8)","v":0},null,{"$f":"IF(INDEX(Objednavka!A:J,522,10)=\"\",\"\",INDEX(Objednavka!A:J,522,10))","v":""}]
[null,{"$f":"IF(INDEX(Objednavka!A:I,523,3)=\"\",INDEX(Objednavka!A:I,523,1),INDEX(Objednavka!A:I,523,3))","v":0},null,null,null,null,null,{"$f":"INDEX(Objednavka!A:I,523,4)","v":0},null,{"$f":"INDEX(Objednavka!A:I,523,5)","v":0},{"$f":"INDEX(Objednavka!A:I,523,7)","v":0},{"$f":"INDEX(Objednavka!A:I,523,8)","v":0},null,{"$f":"IF(INDEX(Objednavka!A:J,523,10)=\"\",\"\",INDEX(Objednavka!A:J,523,10))","v":""}]
[null,{"$f":"IF(INDEX(Objednavka!A:I,524,3)=\"\",INDEX(Objednavka!A:I,524,1),INDEX(Objednavka!A:I,524,3))","v":0},null,null,null,null,null,{"$f":"INDEX(Objednavka!A:I,524,4)","v":0},null,{"$f":"INDEX(Objednavka!A:I,524,5)","v":0},{"$f":"INDEX(Objednavka!A:I,524,7)","v":0},{"$f":"INDEX(Objednavka!A:I,524,8)","v":0},null,{"$f":"IF(INDEX(Objednavka!A:J,524,10)=\"\",\"\",INDEX(Objednavka!A:J,524,10))","v":""}]
[null,{"$f":"IF(INDEX(Objednavka!A:I,525,3)=\"\",INDEX(Objednavka!A:I,525,1),INDEX(Objednavka!A:I,525,3))","v":0},null,null,null,null,null,{"$f":"INDEX(Objednavka!A:I,525,4)","v":0},null,{"$f":"INDEX(Objednavka!A:I,525,5)","v":0},{"$f":"INDEX(Objednavka!A:I,525,7)","v":0},{"$f":"INDEX(Objednavka!A:I,525,8)","v":0},null,{"$f":"IF(INDEX(Objednavka!A:J,525,10)=\"\",\"\",INDEX(Objednavka!A:J,525,10))","v":""}]
[null,{"$f":"IF(INDEX(Objednavka!A:I,526,3)=\"\",INDEX(Objednavka!A:I,526,1),INDEX(Objednavka!A:I,526,3))","v":0},null,null,null,null,null,{"$f":"INDEX(Objednavka!A:I,526,4)","v":0},null,{"$f":"INDEX(Objednavka!A:I,526,5)","v":0},{"$f":"INDEX(Objednavka!A:I,526,7)","v":0},{"$f":"INDEX(Objednavka!A:I,526,8)","v":0},null,{"$f":"IF(INDEX(Objednavka!A:J,526,10)=\"\",\"\",INDEX(Objednavka!A:J,526,10))","v":""}]
[null,{"$f":"IF(INDEX(Objednavka!A:I,527,3)=\"\",INDEX(Objednavka!A:I,527,1),INDEX(Objednavka!A:I,527,3))","v":0},null,null,null,null,null,{"$f":"INDEX(Objednavka!A:I,527,4)","v":0},null,{"$f":"INDEX(Objednavka!A:I,527,5)","v":0},{"$f":"INDEX(Objednavka!A:I,527,7)","v":0},{"$f":"INDEX(Objednavka!A:I,527,8)","v":0},null,{"$f":"IF(INDEX(Objednavka!A:J,527,10)=\"\",\"\",INDEX(Objednavka!A:J,527,10))","v":""}]
[null,{"$f":"IF(INDEX(Objednavka!A:I,528,3)=\"\",INDEX(Objednavka!A:I,528,1),INDEX(Objednavka!A:I,528,3))","v":0},null,null,null,null,null,{"$f":"INDEX(Objednavka!A:I,528,4)","v":0},null,{"$f":"INDEX(Objednavka!A:I,528,5)","v":0},{"$f":"INDEX(Objednavka!A:I,528,7)","v":0},{"$f":"INDEX(Objednavka!A:I,528,8)","v":0},null,{"$f":"IF(INDEX(Objednavka!A:J,528,10)=\"\",\"\",INDEX(Objednavka!A:J,528,10))","v":""}]
[null,{"$f":"IF(INDEX(Objednavka!A:I,529,3)=\"\",INDEX(Objednavka!A:I,529,1),INDEX(Objednavka!A:I,529,3))","v":0},null,null,null,null,null,{"$f":"INDEX(Objednavka!A:I,529,4)","v":0},null,{"$f":"INDEX(Objednavka!A:I,529,5)","v":0},{"$f":"INDEX(Objednavka!A:I,529,7)","v":0},{"$f":"INDEX(Objednavka!A:I,529,8)","v":0},null,{"$f":"IF(INDEX(Objednavka!A:J,529,10)=\"\",\"\",INDEX(Objednavka!A:J,529,10))","v":""}]
[null,{"$f":"IF(INDEX(Objednavka!A:I,530,3)=\"\",INDEX(Objednavka!A:I,530,1),INDEX(Objednavka!A:I,530,3))","v":0},null,null,null,null,null,{"$f":"INDEX(Objednavka!A:I,530,4)","v":0},null,{"$f":"INDEX(Objednavka!A:I,530,5)","v":0},{"$f":"INDEX(Objednavka!A:I,530,7)","v":0},{"$f":"INDEX(Objednavka!A:I,530,8)","v":0},null,{"$f":"IF(INDEX(Objednavka!A:J,530,10)=\"\",\"\",INDEX(Objednavka!A:J,530,10))","v":""}]
[null,{"$f":"IF(INDEX(Objednavka!A:I,531,3)=\"\",INDEX(Objednavka!A:I,531,1),INDEX(Objednavka!A:I,531,3))","v":0},null,null,null,null,null,{"$f":"INDEX(Objednavka!A:I,531,4)","v":0},null,{"$f":"INDEX(Objednavka!A:I,531,5)","v":0},{"$f":"INDEX(Objednavka!A:I,531,7)","v":0},{"$f":"INDEX(Objednavka!A:I,531,8)","v":0},null,{"$f":"IF(INDEX(Objednavka!A:J,531,10)=\"\",\"\",INDEX(Objednavka!A:J,531,10))","v":""}]
[null,{"$f":"IF(INDEX(Objednavka!A:I,532,3)=\"\",INDEX(Objednavka!A:I,532,1),INDEX(Objednavka!A:I,532,3))","v":0},null,null,null,null,null,{"$f":"INDEX(Objednavka!A:I,532,4)","v":0},null,{"$f":"INDEX(Objednavka!A:I,532,5)","v":0},{"$f":"INDEX(Objednavka!A:I,532,7)","v":0},{"$f":"INDEX(Objednavka!A:I,532,8)","v":0},null,{"$f":"IF(INDEX(Objednavka!A:J,532,10)=\"\",\"\",INDEX(Objednavka!A:J,532,10))","v":""}]
[null,{"$f":"IF(INDEX(Objednavka!A:I,533,3)=\"\",INDEX(Objednavka!A:I,533,1),INDEX(Objednavka!A:I,533,3))","v":0},null,null,null,null,null,{"$f":"INDEX(Objednavka!A:I,533,4)","v":0},null,{"$f":"INDEX(Objednavka!A:I,533,5)","v":0},{"$f":"INDEX(Objednavka!A:I,533,7)","v":0},{"$f":"INDEX(Objednavka!A:I,533,8)","v":0},null,{"$f":"IF(INDEX(Objednavka!A:J,533,10)=\"\",\"\",INDEX(Objednavka!A:J,533,10))","v":""}]
[null,{"$f":"IF(INDEX(Objednavka!A:I,534,3)=\"\",INDEX(Objednavka!A:I,534,1),INDEX(Objednavka!A:I,534,3))","v":0},null,null,null,null,null,{"$f":"INDEX(Objednavka!A:I,534,4)","v":0},null,{"$f":"INDEX(Objednavka!A:I,534,5)","v":0},{"$f":"INDEX(Objednavka!A:I,534,7)","v":0},{"$f":"INDEX(Objednavka!A:I,534,8)","v":0},null,{"$f":"IF(INDEX(Objednavka!A:J,534,10)=\"\",\"\",INDEX(Objednavka!A:J,534,10))","v":""}]
[null,{"$f":"IF(INDEX(Objednavka!A:I,535,3)=\"\",INDEX(Objednavka!A:I,535,1),INDEX(Objednavka!A:I,535,3))","v":0},null,null,null,null,null,{"$f":"INDEX(Objednavka!A:I,535,4)","v":0},null,{"$f":"INDEX(Objednavka!A:I,535,5)","v":0},{"$f":"INDEX(Objednavka!A:I,535,7)","v":0},{"$f":"INDEX(Objednavka!A:I,535,8)","v":0},null,{"$f":"IF(INDEX(Objednavka!A:J,535,10)=\"\",\"\",INDEX(Objednavka!A:J,535,10))","v":""}]
[null,{"$f":"IF(INDEX(Objednavka!A:I,536,3)=\"\",INDEX(Objednavka!A:I,536,1),INDEX(Objednavka!A:I,536,3))","v":0},null,null,null,null,null,{"$f":"INDEX(Objednavka!A:I,536,4)","v":0},null,{"$f":"INDEX(Objednavka!A:I,536,5)","v":0},{"$f":"INDEX(Objednavka!A:I,536,7)","v":0},{"$f":"INDEX(Objednavka!A:I,536,8)","v":0},null,{"$f":"IF(INDEX(Objednavka!A:J,536,10)=\"\",\"\",INDEX(Objednavka!A:J,536,10))","v":""}]
[null,{"$f":"IF(INDEX(Objednavka!A:I,537,3)=\"\",INDEX(Objednavka!A:I,537,1),INDEX(Objednavka!A:I,537,3))","v":0},null,null,null,null,null,{"$f":"INDEX(Objednavka!A:I,537,4)","v":0},null,{"$f":"INDEX(Objednavka!A:I,537,5)","v":0},{"$f":"INDEX(Objednavka!A:I,537,7)","v":0},{"$f":"INDEX(Objednavka!A:I,537,8)","v":0},null,{"$f":"IF(INDEX(Objednavka!A:J,537,10)=\"\",\"\",INDEX(Objednavka!A:J,537,10))","v":""}]
[null,{"$f":"IF(INDEX(Objednavka!A:I,538,3)=\"\",INDEX(Objednavka!A:I,538,1),INDEX(Objednavka!A:I,538,3))","v":0},null,null,null,null,null,{"$f":"INDEX(Objednavka!A:I,538,4)","v":0},null,{"$f":"INDEX(Objednavka!A:I,538,5)","v":0},{"$f":"INDEX(Objednavka!A:I,538,7)","v":0},{"$f":"INDEX(Objednavka!A:I,538,8)","v":0},null,{"$f":"IF(INDEX(Objednavka!A:J,538,10)=\"\",\"\",INDEX(Objednavka!A:J,538,10))","v":""}]
[null,{"$f":"IF(INDEX(Objednavka!A:I,539,3)=\"\",INDEX(Objednavka!A:I,539,1),INDEX(Objednavka!A:I,539,3))","v":0},null,null,null,null,null,{"$f":"INDEX(Objednavka!A:I,539,4)","v":0},null,{"$f":"INDEX(Objednavka!A:I,539,5)","v":0},{"$f":"INDEX(Objednavka!A:I,539,7)","v":0},{"$f":"INDEX(Objednavka!A:I,539,8)","v":0},null,{"$f":"IF(INDEX(Objednavka!A:J,539,10)=\"\",\"\",INDEX(Objednavka!A:J,539,10))","v":""}]
[null,{"$f":"IF(INDEX(Objednavka!A:I,540,3)=\"\",INDEX(Objednavka!A:I,540,1),INDEX(Objednavka!A:I,540,3))","v":0},null,null,null,null,null,{"$f":"INDEX(Objednavka!A:I,540,4)","v":0},null,{"$f":"INDEX(Objednavka!A:I,540,5)","v":0},{"$f":"INDEX(Objednavka!A:I,540,7)","v":0},{"$f":"INDEX(Objednavka!A:I,540,8)","v":0},null,{"$f":"IF(INDEX(Objednavka!A:J,540,10)=\"\",\"\",INDEX(Objednavka!A:J,540,10))","v":""}]
[null,{"$f":"IF(INDEX(Objednavka!A:I,541,3)=\"\",INDEX(Objednavka!A:I,541,1),INDEX(Objednavka!A:I,541,3))","v":0},null,null,null,null,null,{"$f":"INDEX(Objednavka!A:I,541,4)","v":0},null,{"$f":"INDEX(Objednavka!A:I,541,5)","v":0},{"$f":"INDEX(Objednavka!A:I,541,7)","v":0},{"$f":"INDEX(Objednavka!A:I,541,8)","v":0},null,{"$f":"IF(INDEX(Objednavka!A:J,541,10)=\"\",\"\",INDEX(Objednavka!A:J,541,10))","v":""}]
[null,{"$f":"IF(INDEX(Objednavka!A:I,542,3)=\"\",INDEX(Objednavka!A:I,542,1),INDEX(Objednavka!A:I,542,3))","v":0},null,null,null,null,null,{"$f":"INDEX(Objednavka!A:I,542,4)","v":0},null,{"$f":"INDEX(Objednavka!A:I,542,5)","v":0},{"$f":"INDEX(Objednavka!A:I,542,7)","v":0},{"$f":"INDEX(Objednavka!A:I,542,8)","v":0},null,{"$f":"IF(INDEX(Objednavka!A:J,542,10)=\"\",\"\",INDEX(Objednavka!A:J,542,10))","v":""}]
[null,{"$f":"IF(INDEX(Objednavka!A:I,543,3)=\"\",INDEX(Objednavka!A:I,543,1),INDEX(Objednavka!A:I,543,3))","v":0},null,null,null,null,null,{"$f":"INDEX(Objednavka!A:I,543,4)","v":0},null,{"$f":"INDEX(Objednavka!A:I,543,5)","v":0},{"$f":"INDEX(Objednavka!A:I,543,7)","v":0},{"$f":"INDEX(Objednavka!A:I,543,8)","v":0},null,{"$f":"IF(INDEX(Objednavka!A:J,543,10)=\"\",\"\",INDEX(Objednavka!A:J,543,10))","v":""}]
[null,{"$f":"IF(INDEX(Objednavka!A:I,544,3)=\"\",INDEX(Objednavka!A:I,544,1),INDEX(Objednavka!A:I,544,3))","v":0},null,null,null,null,null,{"$f":"INDEX(Objednavka!A:I,544,4)","v":0},null,{"$f":"INDEX(Objednavka!A:I,544,5)","v":0},{"$f":"INDEX(Objednavka!A:I,544,7)","v":0},{"$f":"INDEX(Objednavka!A:I,544,8)","v":0},null,{"$f":"IF(INDEX(Objednavka!A:J,544,10)=\"\",\"\",INDEX(Objednavka!A:J,544,10))","v":""}]
[null,{"$f":"IF(INDEX(Objednavka!A:I,545,3)=\"\",INDEX(Objednavka!A:I,545,1),INDEX(Objednavka!A:I,545,3))","v":0},null,null,null,null,null,{"$f":"INDEX(Objednavka!A:I,545,4)","v":0},null,{"$f":"INDEX(Objednavka!A:I,545,5)","v":0},{"$f":"INDEX(Objednavka!A:I,545,7)","v":0},{"$f":"INDEX(Objednavka!A:I,545,8)","v":0},null,{"$f":"IF(INDEX(Objednavka!A:J,545,10)=\"\",\"\",INDEX(Objednavka!A:J,545,10))","v":""}]
[null,{"$f":"IF(INDEX(Objednavka!A:I,546,3)=\"\",INDEX(Objednavka!A:I,546,1),INDEX(Objednavka!A:I,546,3))","v":0},null,null,null,null,null,{"$f":"INDEX(Objednavka!A:I,546,4)","v":0},null,{"$f":"INDEX(Objednavka!A:I,546,5)","v":0},{"$f":"INDEX(Objednavka!A:I,546,7)","v":0},{"$f":"INDEX(Objednavka!A:I,546,8)","v":0},null,{"$f":"IF(INDEX(Objednavka!A:J,546,10)=\"\",\"\",INDEX(Objednavka!A:J,546,10))","v":""}]
[null,{"$f":"IF(INDEX(Objednavka!A:I,547,3)=\"\",INDEX(Objednavka!A:I,547,1),INDEX(Objednavka!A:I,547,3))","v":0},null,null,null,null,null,{"$f":"INDEX(Objednavka!A:I,547,4)","v":0},null,{"$f":"INDEX(Objednavka!A:I,547,5)","v":0},{"$f":"INDEX(Objednavka!A:I,547,7)","v":0},{"$f":"INDEX(Objednavka!A:I,547,8)","v":0},null,{"$f":"IF(INDEX(Objednavka!A:J,547,10)=\"\",\"\",INDEX(Objednavka!A:J,547,10))","v":""}]
[null,{"$f":"IF(INDEX(Objednavka!A:I,548,3)=\"\",INDEX(Objednavka!A:I,548,1),INDEX(Objednavka!A:I,548,3))","v":0},null,null,null,null,null,{"$f":"INDEX(Objednavka!A:I,548,4)","v":0},null,{"$f":"INDEX(Objednavka!A:I,548,5)","v":0},{"$f":"INDEX(Objednavka!A:I,548,7)","v":0},{"$f":"INDEX(Objednavka!A:I,548,8)","v":0},null,{"$f":"IF(INDEX(Objednavka!A:J,548,10)=\"\",\"\",INDEX(Objednavka!A:J,548,10))","v":""}]
[null,{"$f":"IF(INDEX(Objednavka!A:I,549,3)=\"\",INDEX(Objednavka!A:I,549,1),INDEX(Objednavka!A:I,549,3))","v":0},null,null,null,null,null,{"$f":"INDEX(Objednavka!A:I,549,4)","v":0},null,{"$f":"INDEX(Objednavka!A:I,549,5)","v":0},{"$f":"INDEX(Objednavka!A:I,549,7)","v":0},{"$f":"INDEX(Objednavka!A:I,549,8)","v":0},null,{"$f":"IF(INDEX(Objednavka!A:J,549,10)=\"\",\"\",INDEX(Objednavka!A:J,549,10))","v":""}]
[null,{"$f":"IF(INDEX(Objednavka!A:I,550,3)=\"\",INDEX(Objednavka!A:I,550,1),INDEX(Objednavka!A:I,550,3))","v":0},null,null,null,null,null,{"$f":"INDEX(Objednavka!A:I,550,4)","v":0},null,{"$f":"INDEX(Objednavka!A:I,550,5)","v":0},{"$f":"INDEX(Objednavka!A:I,550,7)","v":0},{"$f":"INDEX(Objednavka!A:I,550,8)","v":0},null,{"$f":"IF(INDEX(Objednavka!A:J,550,10)=\"\",\"\",INDEX(Objednavka!A:J,550,10))","v":""}]
[null,{"$f":"IF(INDEX(Objednavka!A:I,551,3)=\"\",INDEX(Objednavka!A:I,551,1),INDEX(Objednavka!A:I,551,3))","v":0},null,null,null,null,null,{"$f":"INDEX(Objednavka!A:I,551,4)","v":0},null,{"$f":"INDEX(Objednavka!A:I,551,5)","v":0},{"$f":"INDEX(Objednavka!A:I,551,7)","v":0},{"$f":"INDEX(Objednavka!A:I,551,8)","v":0},null,{"$f":"IF(INDEX(Objednavka!A:J,551,10)=\"\",\"\",INDEX(Objednavka!A:J,551,10))","v":""}]
[null,{"$f":"IF(INDEX(Objednavka!A:I,552,3)=\"\",INDEX(Objednavka!A:I,552,1),INDEX(Objednavka!A:I,552,3))","v":0},null,null,null,null,null,{"$f":"INDEX(Objednavka!A:I,552,4)","v":0},null,{"$f":"INDEX(Objednavka!A:I,552,5)","v":0},{"$f":"INDEX(Objednavka!A:I,552,7)","v":0},{"$f":"INDEX(Objednavka!A:I,552,8)","v":0},null,{"$f":"IF(INDEX(Objednavka!A:J,552,10)=\"\",\"\",INDEX(Objednavka!A:J,552,10))","v":""}]
[null,{"$f":"IF(INDEX(Objednavka!A:I,553,3)=\"\",INDEX(Objednavka!A:I,553,1),INDEX(Objednavka!A:I,553,3))","v":0},null,null,null,null,null,{"$f":"INDEX(Objednavka!A:I,553,4)","v":0},null,{"$f":"INDEX(Objednavka!A:I,553,5)","v":0},{"$f":"INDEX(Objednavka!A:I,553,7)","v":0},{"$f":"INDEX(Objednavka!A:I,553,8)","v":0},null,{"$f":"IF(INDEX(Objednavka!A:J,553,10)=\"\",\"\",INDEX(Objednavka!A:J,553,10))","v":""}]
[null,{"$f":"IF(INDEX(Objednavka!A:I,554,3)=\"\",INDEX(Objednavka!A:I,554,1),INDEX(Objednavka!A:I,554,3))","v":0},null,null,null,null,null,{"$f":"INDEX(Objednavka!A:I,554,4)","v":0},null,{"$f":"INDEX(Objednavka!A:I,554,5)","v":0},{"$f":"INDEX(Objednavka!A:I,554,7)","v":0},{"$f":"INDEX(Objednavka!A:I,554,8)","v":0},null,{"$f":"IF(INDEX(Objednavka!A:J,554,10)=\"\",\"\",INDEX(Objednavka!A:J,554,10))","v":""}]
[null,{"$f":"IF(INDEX(Objednavka!A:I,555,3)=\"\",INDEX(Objednavka!A:I,555,1),INDEX(Objednavka!A:I,555,3))","v":0},null,null,null,null,null,{"$f":"INDEX(Objednavka!A:I,555,4)","v":0},null,{"$f":"INDEX(Objednavka!A:I,555,5)","v":0},{"$f":"INDEX(Objednavka!A:I,555,7)","v":0},{"$f":"INDEX(Objednavka!A:I,555,8)","v":0},null,{"$f":"IF(INDEX(Objednavka!A:J,555,10)=\"\",\"\",INDEX(Objednavka!A:J,555,10))","v":""}]
[null,{"$f":"IF(INDEX(Objednavka!A:I,556,3)=\"\",INDEX(Objednavka!A:I,556,1),INDEX(Objednavka!A:I,556,3))","v":0},null,null,null,null,null,{"$f":"INDEX(Objednavka!A:I,556,4)","v":0},null,{"$f":"INDEX(Objednavka!A:I,556,5)","v":0},{"$f":"INDEX(Objednavka!A:I,556,7)","v":0},{"$f":"INDEX(Objednavka!A:I,556,8)","v":0},null,{"$f":"IF(INDEX(Objednavka!A:J,556,10)=\"\",\"\",INDEX(Objednavka!A:J,556,10))","v":""}]
[null,{"$f":"IF(INDEX(Objednavka!A:I,557,3)=\"\",INDEX(Objednavka!A:I,557,1),INDEX(Objednavka!A:I,557,3))","v":0},null,null,null,null,null,{"$f":"INDEX(Objednavka!A:I,557,4)","v":0},null,{"$f":"INDEX(Objednavka!A:I,557,5)","v":0},{"$f":"INDEX(Objednavka!A:I,557,7)","v":0},{"$f":"INDEX(Objednavka!A:I,557,8)","v":0},null,{"$f":"IF(INDEX(Objednavka!A:J,557,10)=\"\",\"\",INDEX(Objednavka!A:J,557,10))","v":""}]
[null,{"$f":"IF(INDEX(Objednavka!A:I,558,3)=\"\",INDEX(Objednavka!A:I,558,1),INDEX(Objednavka!A:I,558,3))","v":0},null,null,null,null,null,{"$f":"INDEX(Objednavka!A:I,558,4)","v":0},null,{"$f":"INDEX(Objednavka!A:I,558,5)","v":0},{"$f":"INDEX(Objednavka!A:I,558,7)","v":0},{"$f":"INDEX(Objednavka!A:I,558,8)","v":0},null,{"$f":"IF(INDEX(Objednavka!A:J,558,10)=\"\",\"\",INDEX(Objednavka!A:J,558,10))","v":""}]
[null,{"$f":"IF(INDEX(Objednavka!A:I,559,3)=\"\",INDEX(Objednavka!A:I,559,1),INDEX(Objednavka!A:I,559,3))","v":0},null,null,null,null,null,{"$f":"INDEX(Objednavka!A:I,559,4)","v":0},null,{"$f":"INDEX(Objednavka!A:I,559,5)","v":0},{"$f":"INDEX(Objednavka!A:I,559,7)","v":0},{"$f":"INDEX(Objednavka!A:I,559,8)","v":0},null,{"$f":"IF(INDEX(Objednavka!A:J,559,10)=\"\",\"\",INDEX(Objednavka!A:J,559,10))","v":""}]
[null,{"$f":"IF(INDEX(Objednavka!A:I,560,3)=\"\",INDEX(Objednavka!A:I,560,1),INDEX(Objednavka!A:I,560,3))","v":0},null,null,null,null,null,{"$f":"INDEX(Objednavka!A:I,560,4)","v":0},null,{"$f":"INDEX(Objednavka!A:I,560,5)","v":0},{"$f":"INDEX(Objednavka!A:I,560,7)","v":0},{"$f":"INDEX(Objednavka!A:I,560,8)","v":0},null,{"$f":"IF(INDEX(Objednavka!A:J,560,10)=\"\",\"\",INDEX(Objednavka!A:J,560,10))","v":""}]
[null,{"$f":"IF(INDEX(Objednavka!A:I,561,3)=\"\",INDEX(Objednavka!A:I,561,1),INDEX(Objednavka!A:I,561,3))","v":0},null,null,null,null,null,{"$f":"INDEX(Objednavka!A:I,561,4)","v":0},null,{"$f":"INDEX(Objednavka!A:I,561,5)","v":0},{"$f":"INDEX(Objednavka!A:I,561,7)","v":0},{"$f":"INDEX(Objednavka!A:I,561,8)","v":0},null,{"$f":"IF(INDEX(Objednavka!A:J,561,10)=\"\",\"\",INDEX(Objednavka!A:J,561,10))","v":""}]
[null,{"$f":"IF(INDEX(Objednavka!A:I,562,3)=\"\",INDEX(Objednavka!A:I,562,1),INDEX(Objednavka!A:I,562,3))","v":0},null,null,null,null,null,{"$f":"INDEX(Objednavka!A:I,562,4)","v":0},null,{"$f":"INDEX(Objednavka!A:I,562,5)","v":0},{"$f":"INDEX(Objednavka!A:I,562,7)","v":0},{"$f":"INDEX(Objednavka!A:I,562,8)","v":0},null,{"$f":"IF(INDEX(Objednavka!A:J,562,10)=\"\",\"\",INDEX(Objednavka!A:J,562,10))","v":""}]
[null,{"$f":"IF(INDEX(Objednavka!A:I,563,3)=\"\",INDEX(Objednavka!A:I,563,1),INDEX(Objednavka!A:I,563,3))","v":0},null,null,null,null,null,{"$f":"INDEX(Objednavka!A:I,563,4)","v":0},null,{"$f":"INDEX(Objednavka!A:I,563,5)","v":0},{"$f":"INDEX(Objednavka!A:I,563,7)","v":0},{"$f":"INDEX(Objednavka!A:I,563,8)","v":0},null,{"$f":"IF(INDEX(Objednavka!A:J,563,10)=\"\",\"\",INDEX(Objednavka!A:J,563,10))","v":""}]
[null,{"$f":"IF(INDEX(Objednavka!A:I,564,3)=\"\",INDEX(Objednavka!A:I,564,1),INDEX(Objednavka!A:I,564,3))","v":0},null,null,null,null,null,{"$f":"INDEX(Objednavka!A:I,564,4)","v":0},null,{"$f":"INDEX(Objednavka!A:I,564,5)","v":0},{"$f":"INDEX(Objednavka!A:I,564,7)","v":0},{"$f":"INDEX(Objednavka!A:I,564,8)","v":0},null,{"$f":"IF(INDEX(Objednavka!A:J,564,10)=\"\",\"\",INDEX(Objednavka!A:J,564,10))","v":""}]
[null,{"$f":"IF(INDEX(Objednavka!A:I,565,3)=\"\",INDEX(Objednavka!A:I,565,1),INDEX(Objednavka!A:I,565,3))","v":0},null,null,null,null,null,{"$f":"INDEX(Objednavka!A:I,565,4)","v":0},null,{"$f":"INDEX(Objednavka!A:I,565,5)","v":0},{"$f":"INDEX(Objednavka!A:I,565,7)","v":0},{"$f":"INDEX(Objednavka!A:I,565,8)","v":0},null,{"$f":"IF(INDEX(Objednavka!A:J,565,10)=\"\",\"\",INDEX(Objednavka!A:J,565,10))","v":""}]
[null,{"$f":"IF(INDEX(Objednavka!A:I,566,3)=\"\",INDEX(Objednavka!A:I,566,1),INDEX(Objednavka!A:I,566,3))","v":0},null,null,null,null,null,{"$f":"INDEX(Objednavka!A:I,566,4)","v":0},null,{"$f":"INDEX(Objednavka!A:I,566,5)","v":0},{"$f":"INDEX(Objednavka!A:I,566,7)","v":0},{"$f":"INDEX(Objednavka!A:I,566,8)","v":0},null,{"$f":"IF(INDEX(Objednavka!A:J,566,10)=\"\",\"\",INDEX(Objednavka!A:J,566,10))","v":""}]
[null,{"$f":"IF(INDEX(Objednavka!A:I,567,3)=\"\",INDEX(Objednavka!A:I,567,1),INDEX(Objednavka!A:I,567,3))","v":0},null,null,null,null,null,{"$f":"INDEX(Objednavka!A:I,567,4)","v":0},null,{"$f":"INDEX(Objednavka!A:I,567,5)","v":0},{"$f":"INDEX(Objednavka!A:I,567,7)","v":0},{"$f":"INDEX(Objednavka!A:I,567,8)","v":0},null,{"$f":"IF(INDEX(Objednavka!A:J,567,10)=\"\",\"\",INDEX(Objednavka!A:J,567,10))","v":""}]
[null,{"$f":"IF(INDEX(Objednavka!A:I,568,3)=\"\",INDEX(Objednavka!A:I,568,1),INDEX(Objednavka!A:I,568,3))","v":0},null,null,null,null,null,{"$f":"INDEX(Objednavka!A:I,568,4)","v":0},null,{"$f":"INDEX(Objednavka!A:I,568,5)","v":0},{"$f":"INDEX(Objednavka!A:I,568,7)","v":0},{"$f":"INDEX(Objednavka!A:I,568,8)","v":0},null,{"$f":"IF(INDEX(Objednavka!A:J,568,10)=\"\",\"\",INDEX(Objednavka!A:J,568,10))","v":""}]
[null,{"$f":"IF(INDEX(Objednavka!A:I,569,3)=\"\",INDEX(Objednavka!A:I,569,1),INDEX(Objednavka!A:I,569,3))","v":0},null,null,null,null,null,{"$f":"INDEX(Objednavka!A:I,569,4)","v":0},null,{"$f":"INDEX(Objednavka!A:I,569,5)","v":0},{"$f":"INDEX(Objednavka!A:I,569,7)","v":0},{"$f":"INDEX(Objednavka!A:I,569,8)","v":0},null,{"$f":"IF(INDEX(Objednavka!A:J,569,10)=\"\",\"\",INDEX(Objednavka!A:J,569,10))","v":""}]
[null,{"$f":"IF(INDEX(Objednavka!A:I,570,3)=\"\",INDEX(Objednavka!A:I,570,1),INDEX(Objednavka!A:I,570,3))","v":0},null,null,null,null,null,{"$f":"INDEX(Objednavka!A:I,570,4)","v":0},null,{"$f":"INDEX(Objednavka!A:I,570,5)","v":0},{"$f":"INDEX(Objednavka!A:I,570,7)","v":0},{"$f":"INDEX(Objednavka!A:I,570,8)","v":0},null,{"$f":"IF(INDEX(Objednavka!A:J,570,10)=\"\",\"\",INDEX(Objednavka!A:J,570,10))","v":""}]
[null,{"$f":"IF(INDEX(Objednavka!A:I,571,3)=\"\",INDEX(Objednavka!A:I,571,1),INDEX(Objednavka!A:I,571,3))","v":0},null,null,null,null,null,{"$f":"INDEX(Objednavka!A:I,571,4)","v":0},null,{"$f":"INDEX(Objednavka!A:I,571,5)","v":0},{"$f":"INDEX(Objednavka!A:I,571,7)","v":0},{"$f":"INDEX(Objednavka!A:I,571,8)","v":0},null,{"$f":"IF(INDEX(Objednavka!A:J,571,10)=\"\",\"\",INDEX(Objednavka!A:J,571,10))","v":""}]
[null,{"$f":"IF(INDEX(Objednavka!A:I,572,3)=\"\",INDEX(Objednavka!A:I,572,1),INDEX(Objednavka!A:I,572,3))","v":0},null,null,null,null,null,{"$f":"INDEX(Objednavka!A:I,572,4)","v":0},null,{"$f":"INDEX(Objednavka!A:I,572,5)","v":0},{"$f":"INDEX(Objednavka!A:I,572,7)","v":0},{"$f":"INDEX(Objednavka!A:I,572,8)","v":0},null,{"$f":"IF(INDEX(Objednavka!A:J,572,10)=\"\",\"\",INDEX(Objednavka!A:J,572,10))","v":""}]
[null,{"$f":"IF(INDEX(Objednavka!A:I,573,3)=\"\",INDEX(Objednavka!A:I,573,1),INDEX(Objednavka!A:I,573,3))","v":0},null,null,null,null,null,{"$f":"INDEX(Objednavka!A:I,573,4)","v":0},null,{"$f":"INDEX(Objednavka!A:I,573,5)","v":0},{"$f":"INDEX(Objednavka!A:I,573,7)","v":0},{"$f":"INDEX(Objednavka!A:I,573,8)","v":0},null,{"$f":"IF(INDEX(Objednavka!A:J,573,10)=\"\",\"\",INDEX(Objednavka!A:J,573,10))","v":""}]
[null,{"$f":"IF(INDEX(Objednavka!A:I,574,3)=\"\",INDEX(Objednavka!A:I,574,1),INDEX(Objednavka!A:I,574,3))","v":0},null,null,null,null,null,{"$f":"INDEX(Objednavka!A:I,574,4)","v":0},null,{"$f":"INDEX(Objednavka!A:I,574,5)","v":0},{"$f":"INDEX(Objednavka!A:I,574,7)","v":0},{"$f":"INDEX(Objednavka!A:I,574,8)","v":0},null,{"$f":"IF(INDEX(Objednavka!A:J,574,10)=\"\",\"\",INDEX(Objednavka!A:J,574,10))","v":""}]
[null,{"$f":"IF(INDEX(Objednavka!A:I,575,3)=\"\",INDEX(Objednavka!A:I,575,1),INDEX(Objednavka!A:I,575,3))","v":0},null,null,null,null,null,{"$f":"INDEX(Objednavka!A:I,575,4)","v":0},null,{"$f":"INDEX(Objednavka!A:I,575,5)","v":0},{"$f":"INDEX(Objednavka!A:I,575,7)","v":0},{"$f":"INDEX(Objednavka!A:I,575,8)","v":0},null,{"$f":"IF(INDEX(Objednavka!A:J,575,10)=\"\",\"\",INDEX(Objednavka!A:J,575,10))","v":""}]
[null,{"$f":"IF(INDEX(Objednavka!A:I,576,3)=\"\",INDEX(Objednavka!A:I,576,1),INDEX(Objednavka!A:I,576,3))","v":0},null,null,null,null,null,{"$f":"INDEX(Objednavka!A:I,576,4)","v":0},null,{"$f":"INDEX(Objednavka!A:I,576,5)","v":0},{"$f":"INDEX(Objednavka!A:I,576,7)","v":0},{"$f":"INDEX(Objednavka!A:I,576,8)","v":0},null,{"$f":"IF(INDEX(Objednavka!A:J,576,10)=\"\",\"\",INDEX(Objednavka!A:J,576,10))","v":""}]
[null,{"$f":"IF(INDEX(Objednavka!A:I,577,3)=\"\",INDEX(Objednavka!A:I,577,1),INDEX(Objednavka!A:I,577,3))","v":0},null,null,null,null,null,{"$f":"INDEX(Objednavka!A:I,577,4)","v":0},null,{"$f":"INDEX(Objednavka!A:I,577,5)","v":0},{"$f":"INDEX(Objednavka!A:I,577,7)","v":0},{"$f":"INDEX(Objednavka!A:I,577,8)","v":0},null,{"$f":"IF(INDEX(Objednavka!A:J,577,10)=\"\",\"\",INDEX(Objednavka!A:J,577,10))","v":""}]
[null,{"$f":"IF(INDEX(Objednavka!A:I,578,3)=\"\",INDEX(Objednavka!A:I,578,1),INDEX(Objednavka!A:I,578,3))","v":0},null,null,null,null,null,{"$f":"INDEX(Objednavka!A:I,578,4)","v":0},null,{"$f":"INDEX(Objednavka!A:I,578,5)","v":0},{"$f":"INDEX(Objednavka!A:I,578,7)","v":0},{"$f":"INDEX(Objednavka!A:I,578,8)","v":0},null,{"$f":"IF(INDEX(Objednavka!A:J,578,10)=\"\",\"\",INDEX(Objednavka!A:J,578,10))","v":""}]
[null,{"$f":"IF(INDEX(Objednavka!A:I,579,3)=\"\",INDEX(Objednavka!A:I,579,1),INDEX(Objednavka!A:I,579,3))","v":0},null,null,null,null,null,{"$f":"INDEX(Objednavka!A:I,579,4)","v":0},null,{"$f":"INDEX(Objednavka!A:I,579,5)","v":0},{"$f":"INDEX(Objednavka!A:I,579,7)","v":0},{"$f":"INDEX(Objednavka!A:I,579,8)","v":0},null,{"$f":"IF(INDEX(Objednavka!A:J,579,10)=\"\",\"\",INDEX(Objednavka!A:J,579,10))","v":""}]
[null,{"$f":"IF(INDEX(Objednavka!A:I,580,3)=\"\",INDEX(Objednavka!A:I,580,1),INDEX(Objednavka!A:I,580,3))","v":0},null,null,null,null,null,{"$f":"INDEX(Objednavka!A:I,580,4)","v":0},null,{"$f":"INDEX(Objednavka!A:I,580,5)","v":0},{"$f":"INDEX(Objednavka!A:I,580,7)","v":0},{"$f":"INDEX(Objednavka!A:I,580,8)","v":0},null,{"$f":"IF(INDEX(Objednavka!A:J,580,10)=\"\",\"\",INDEX(Objednavka!A:J,580,10))","v":""}]
[null,{"$f":"IF(INDEX(Objednavka!A:I,581,3)=\"\",INDEX(Objednavka!A:I,581,1),INDEX(Objednavka!A:I,581,3))","v":0},null,null,null,null,null,{"$f":"INDEX(Objednavka!A:I,581,4)","v":0},null,{"$f":"INDEX(Objednavka!A:I,581,5)","v":0},{"$f":"INDEX(Objednavka!A:I,581,7)","v":0},{"$f":"INDEX(Objednavka!A:I,581,8)","v":0},null,{"$f":"IF(INDEX(Objednavka!A:J,581,10)=\"\",\"\",INDEX(Objednavka!A:J,581,10))","v":""}]
[null,{"$f":"IF(INDEX(Objednavka!A:I,582,3)=\"\",INDEX(Objednavka!A:I,582,1),INDEX(Objednavka!A:I,582,3))","v":0},null,null,null,null,null,{"$f":"INDEX(Objednavka!A:I,582,4)","v":0},null,{"$f":"INDEX(Objednavka!A:I,582,5)","v":0},{"$f":"INDEX(Objednavka!A:I,582,7)","v":0},{"$f":"INDEX(Objednavka!A:I,582,8)","v":0},null,{"$f":"IF(INDEX(Objednavka!A:J,582,10)=\"\",\"\",INDEX(Objednavka!A:J,582,10))","v":""}]
[null,{"$f":"IF(INDEX(Objednavka!A:I,583,3)=\"\",INDEX(Objednavka!A:I,583,1),INDEX(Objednavka!A:I,583,3))","v":0},null,null,null,null,null,{"$f":"INDEX(Objednavka!A:I,583,4)","v":0},null,{"$f":"INDEX(Objednavka!A:I,583,5)","v":0},{"$f":"INDEX(Objednavka!A:I,583,7)","v":0},{"$f":"INDEX(Objednavka!A:I,583,8)","v":0},null,{"$f":"IF(INDEX(Objednavka!A:J,583,10)=\"\",\"\",INDEX(Objednavka!A:J,583,10))","v":""}]
[null,{"$f":"IF(INDEX(Objednavka!A:I,584,3)=\"\",INDEX(Objednavka!A:I,584,1),INDEX(Objednavka!A:I,584,3))","v":0},null,null,null,null,null,{"$f":"INDEX(Objednavka!A:I,584,4)","v":0},null,{"$f":"INDEX(Objednavka!A:I,584,5)","v":0},{"$f":"INDEX(Objednavka!A:I,584,7)","v":0},{"$f":"INDEX(Objednavka!A:I,584,8)","v":0},null,{"$f":"IF(INDEX(Objednavka!A:J,584,10)=\"\",\"\",INDEX(Objednavka!A:J,584,10))","v":""}]
[null,{"$f":"IF(INDEX(Objednavka!A:I,585,3)=\"\",INDEX(Objednavka!A:I,585,1),INDEX(Objednavka!A:I,585,3))","v":0},null,null,null,null,null,{"$f":"INDEX(Objednavka!A:I,585,4)","v":0},null,{"$f":"INDEX(Objednavka!A:I,585,5)","v":0},{"$f":"INDEX(Objednavka!A:I,585,7)","v":0},{"$f":"INDEX(Objednavka!A:I,585,8)","v":0},null,{"$f":"IF(INDEX(Objednavka!A:J,585,10)=\"\",\"\",INDEX(Objednavka!A:J,585,10))","v":""}]
[null,{"$f":"IF(INDEX(Objednavka!A:I,586,3)=\"\",INDEX(Objednavka!A:I,586,1),INDEX(Objednavka!A:I,586,3))","v":0},null,null,null,null,null,{"$f":"INDEX(Objednavka!A:I,586,4)","v":0},null,{"$f":"INDEX(Objednavka!A:I,586,5)","v":0},{"$f":"INDEX(Objednavka!A:I,586,7)","v":0},{"$f":"INDEX(Objednavka!A:I,586,8)","v":0},null,{"$f":"IF(INDEX(Objednavka!A:J,586,10)=\"\",\"\",INDEX(Objednavka!A:J,586,10))","v":""}]
[null,{"$f":"IF(INDEX(Objednavka!A:I,587,3)=\"\",INDEX(Objednavka!A:I,587,1),INDEX(Objednavka!A:I,587,3))","v":0},null,null,null,null,null,{"$f":"INDEX(Objednavka!A:I,587,4)","v":0},null,{"$f":"INDEX(Objednavka!A:I,587,5)","v":0},{"$f":"INDEX(Objednavka!A:I,587,7)","v":0},{"$f":"INDEX(Objednavka!A:I,587,8)","v":0},null,{"$f":"IF(INDEX(Objednavka!A:J,587,10)=\"\",\"\",INDEX(Objednavka!A:J,587,10))","v":""}]
[null,{"$f":"IF(INDEX(Objednavka!A:I,588,3)=\"\",INDEX(Objednavka!A:I,588,1),INDEX(Objednavka!A:I,588,3))","v":0},null,null,null,null,null,{"$f":"INDEX(Objednavka!A:I,588,4)","v":0},null,{"$f":"INDEX(Objednavka!A:I,588,5)","v":0},{"$f":"INDEX(Objednavka!A:I,588,7)","v":0},{"$f":"INDEX(Objednavka!A:I,588,8)","v":0},null,{"$f":"IF(INDEX(Objednavka!A:J,588,10)=\"\",\"\",INDEX(Objednavka!A:J,588,10))","v":""}]
[null,{"$f":"IF(INDEX(Objednavka!A:I,589,3)=\"\",INDEX(Objednavka!A:I,589,1),INDEX(Objednavka!A:I,589,3))","v":0},null,null,null,null,null,{"$f":"INDEX(Objednavka!A:I,589,4)","v":0},null,{"$f":"INDEX(Objednavka!A:I,589,5)","v":0},{"$f":"INDEX(Objednavka!A:I,589,7)","v":0},{"$f":"INDEX(Objednavka!A:I,589,8)","v":0},null,{"$f":"IF(INDEX(Objednavka!A:J,589,10)=\"\",\"\",INDEX(Objednavka!A:J,589,10))","v":""}]
[null,{"$f":"IF(INDEX(Objednavka!A:I,590,3)=\"\",INDEX(Objednavka!A:I,590,1),INDEX(Objednavka!A:I,590,3))","v":0},null,null,null,null,null,{"$f":"INDEX(Objednavka!A:I,590,4)","v":0},null,{"$f":"INDEX(Objednavka!A:I,590,5)","v":0},{"$f":"INDEX(Objednavka!A:I,590,7)","v":0},{"$f":"INDEX(Objednavka!A:I,590,8)","v":0},null,{"$f":"IF(INDEX(Objednavka!A:J,590,10)=\"\",\"\",INDEX(Objednavka!A:J,590,10))","v":""}]
[null,{"$f":"IF(INDEX(Objednavka!A:I,591,3)=\"\",INDEX(Objednavka!A:I,591,1),INDEX(Objednavka!A:I,591,3))","v":0},null,null,null,null,null,{"$f":"INDEX(Objednavka!A:I,591,4)","v":0},null,{"$f":"INDEX(Objednavka!A:I,591,5)","v":0},{"$f":"INDEX(Objednavka!A:I,591,7)","v":0},{"$f":"INDEX(Objednavka!A:I,591,8)","v":0},null,{"$f":"IF(INDEX(Objednavka!A:J,591,10)=\"\",\"\",INDEX(Objednavka!A:J,591,10))","v":""}]
[null,{"$f":"IF(INDEX(Objednavka!A:I,592,3)=\"\",INDEX(Objednavka!A:I,592,1),INDEX(Objednavka!A:I,592,3))","v":0},null,null,null,null,null,{"$f":"INDEX(Objednavka!A:I,592,4)","v":0},null,{"$f":"INDEX(Objednavka!A:I,592,5)","v":0},{"$f":"INDEX(Objednavka!A:I,592,7)","v":0},{"$f":"INDEX(Objednavka!A:I,592,8)","v":0},null,{"$f":"IF(INDEX(Objednavka!A:J,592,10)=\"\",\"\",INDEX(Objednavka!A:J,592,10))","v":""}]
[null,{"$f":"IF(INDEX(Objednavka!A:I,593,3)=\"\",INDEX(Objednavka!A:I,593,1),INDEX(Objednavka!A:I,593,3))","v":0},null,null,null,null,null,{"$f":"INDEX(Objednavka!A:I,593,4)","v":0},null,{"$f":"INDEX(Objednavka!A:I,593,5)","v":0},{"$f":"INDEX(Objednavka!A:I,593,7)","v":0},{"$f":"INDEX(Objednavka!A:I,593,8)","v":0},null,{"$f":"IF(INDEX(Objednavka!A:J,593,10)=\"\",\"\",INDEX(Objednavka!A:J,593,10))","v":""}]
[null,{"$f":"IF(INDEX(Objednavka!A:I,594,3)=\"\",INDEX(Objednavka!A:I,594,1),INDEX(Objednavka!A:I,594,3))","v":0},null,null,null,null,null,{"$f":"INDEX(Objednavka!A:I,594,4)","v":0},null,{"$f":"INDEX(Objednavka!A:I,594,5)","v":0},{"$f":"INDEX(Objednavka!A:I,594,7)","v":0},{"$f":"INDEX(Objednavka!A:I,594,8)","v":0},null,{"$f":"IF(INDEX(Objednavka!A:J,594,10)=\"\",\"\",INDEX(Objednavka!A:J,594,10))","v":""}]
[null,{"$f":"IF(INDEX(Objednavka!A:I,595,3)=\"\",INDEX(Objednavka!A:I,595,1),INDEX(Objednavka!A:I,595,3))","v":0},null,null,null,null,null,{"$f":"INDEX(Objednavka!A:I,595,4)","v":0},null,{"$f":"INDEX(Objednavka!A:I,595,5)","v":0},{"$f":"INDEX(Objednavka!A:I,595,7)","v":0},{"$f":"INDEX(Objednavka!A:I,595,8)","v":0},null,{"$f":"IF(INDEX(Objednavka!A:J,595,10)=\"\",\"\",INDEX(Objednavka!A:J,595,10))","v":""}]
[null,{"$f":"IF(INDEX(Objednavka!A:I,596,3)=\"\",INDEX(Objednavka!A:I,596,1),INDEX(Objednavka!A:I,596,3))","v":0},null,null,null,null,null,{"$f":"INDEX(Objednavka!A:I,596,4)","v":0},null,{"$f":"INDEX(Objednavka!A:I,596,5)","v":0},{"$f":"INDEX(Objednavka!A:I,596,7)","v":0},{"$f":"INDEX(Objednavka!A:I,596,8)","v":0},null,{"$f":"IF(INDEX(Objednavka!A:J,596,10)=\"\",\"\",INDEX(Objednavka!A:J,596,10))","v":""}]
[null,{"$f":"IF(INDEX(Objednavka!A:I,597,3)=\"\",INDEX(Objednavka!A:I,597,1),INDEX(Objednavka!A:I,597,3))","v":0},null,null,null,null,null,{"$f":"INDEX(Objednavka!A:I,597,4)","v":0},null,{"$f":"INDEX(Objednavka!A:I,597,5)","v":0},{"$f":"INDEX(Objednavka!A:I,597,7)","v":0},{"$f":"INDEX(Objednavka!A:I,597,8)","v":0},null,{"$f":"IF(INDEX(Objednavka!A:J,597,10)=\"\",\"\",INDEX(Objednavka!A:J,597,10))","v":""}]
[null,{"$f":"IF(INDEX(Objednavka!A:I,598,3)=\"\",INDEX(Objednavka!A:I,598,1),INDEX(Objednavka!A:I,598,3))","v":0},null,null,null,null,null,{"$f":"INDEX(Objednavka!A:I,598,4)","v":0},null,{"$f":"INDEX(Objednavka!A:I,598,5)","v":0},{"$f":"INDEX(Objednavka!A:I,598,7)","v":0},{"$f":"INDEX(Objednavka!A:I,598,8)","v":0},null,{"$f":"IF(INDEX(Objednavka!A:J,598,10)=\"\",\"\",INDEX(Objednavka!A:J,598,10))","v":""}]
[null,{"$f":"IF(INDEX(Objednavka!A:I,599,3)=\"\",INDEX(Objednavka!A:I,599,1),INDEX(Objednavka!A:I,599,3))","v":0},null,null,null,null,null,{"$f":"INDEX(Objednavka!A:I,599,4)","v":0},null,{"$f":"INDEX(Objednavka!A:I,599,5)","v":0},{"$f":"INDEX(Objednavka!A:I,599,7)","v":0},{"$f":"INDEX(Objednavka!A:I,599,8)","v":0},null,{"$f":"IF(INDEX(Objednavka!A:J,599,10)=\"\",\"\",INDEX(Objednavka!A:J,599,10))","v":""}]
[null,{"$f":"IF(INDEX(Objednavka!A:I,600,3)=\"\",INDEX(Objednavka!A:I,600,1),INDEX(Objednavka!A:I,600,3))","v":0},null,null,null,null,null,{"$f":"INDEX(Objednavka!A:I,600,4)","v":0},null,{"$f":"INDEX(Objednavka!A:I,600,5)","v":0},{"$f":"INDEX(Objednavka!A:I,600,7)","v":0},{"$f":"INDEX(Objednavka!A:I,600,8)","v":0},null,{"$f":"IF(INDEX(Objednavka!A:J,600,10)=\"\",\"\",INDEX(Objednavka!A:J,600,10))","v":""}]
[null,{"$f":"IF(INDEX(Objednavka!A:I,601,3)=\"\",INDEX(Objednavka!A:I,601,1),INDEX(Objednavka!A:I,601,3))","v":0},null,null,null,null,null,{"$f":"INDEX(Objednavka!A:I,601,4)","v":0},null,{"$f":"INDEX(Objednavka!A:I,601,5)","v":0},{"$f":"INDEX(Objednavka!A:I,601,7)","v":0},{"$f":"INDEX(Objednavka!A:I,601,8)","v":0},null,{"$f":"IF(INDEX(Objednavka!A:J,601,10)=\"\",\"\",INDEX(Objednavka!A:J,601,10))","v":""}]
[null,{"$f":"IF(INDEX(Objednavka!A:I,602,3)=\"\",INDEX(Objednavka!A:I,602,1),INDEX(Objednavka!A:I,602,3))","v":0},null,null,null,null,null,{"$f":"INDEX(Objednavka!A:I,602,4)","v":0},null,{"$f":"INDEX(Objednavka!A:I,602,5)","v":0},{"$f":"INDEX(Objednavka!A:I,602,7)","v":0},{"$f":"INDEX(Objednavka!A:I,602,8)","v":0},null,{"$f":"IF(INDEX(Objednavka!A:J,602,10)=\"\",\"\",INDEX(Objednavka!A:J,602,10))","v":""}]
[null,{"$f":"IF(INDEX(Objednavka!A:I,603,3)=\"\",INDEX(Objednavka!A:I,603,1),INDEX(Objednavka!A:I,603,3))","v":0},null,null,null,null,null,{"$f":"INDEX(Objednavka!A:I,603,4)","v":0},null,{"$f":"INDEX(Objednavka!A:I,603,5)","v":0},{"$f":"INDEX(Objednavka!A:I,603,7)","v":0},{"$f":"INDEX(Objednavka!A:I,603,8)","v":0},null,{"$f":"IF(INDEX(Objednavka!A:J,603,10)=\"\",\"\",INDEX(Objednavka!A:J,603,10))","v":""}]
[null,{"$f":"IF(INDEX(Objednavka!A:I,604,3)=\"\",INDEX(Objednavka!A:I,604,1),INDEX(Objednavka!A:I,604,3))","v":0},null,null,null,null,null,{"$f":"INDEX(Objednavka!A:I,604,4)","v":0},null,{"$f":"INDEX(Objednavka!A:I,604,5)","v":0},{"$f":"INDEX(Objednavka!A:I,604,7)","v":0},{"$f":"INDEX(Objednavka!A:I,604,8)","v":0},null,{"$f":"IF(INDEX(Objednavka!A:J,604,10)=\"\",\"\",INDEX(Objednavka!A:J,604,10))","v":""}]
[null,{"$f":"IF(INDEX(Objednavka!A:I,605,3)=\"\",INDEX(Objednavka!A:I,605,1),INDEX(Objednavka!A:I,605,3))","v":0},null,null,null,null,null,{"$f":"INDEX(Objednavka!A:I,605,4)","v":0},null,{"$f":"INDEX(Objednavka!A:I,605,5)","v":0},{"$f":"INDEX(Objednavka!A:I,605,7)","v":0},{"$f":"INDEX(Objednavka!A:I,605,8)","v":0},null,{"$f":"IF(INDEX(Objednavka!A:J,605,10)=\"\",\"\",INDEX(Objednavka!A:J,605,10))","v":""}]
[null,{"$f":"IF(INDEX(Objednavka!A:I,606,3)=\"\",INDEX(Objednavka!A:I,606,1),INDEX(Objednavka!A:I,606,3))","v":0},null,null,null,null,null,{"$f":"INDEX(Objednavka!A:I,606,4)","v":0},null,{"$f":"INDEX(Objednavka!A:I,606,5)","v":0},{"$f":"INDEX(Objednavka!A:I,606,7)","v":0},{"$f":"INDEX(Objednavka!A:I,606,8)","v":0},null,{"$f":"IF(INDEX(Objednavka!A:J,606,10)=\"\",\"\",INDEX(Objednavka!A:J,606,10))","v":""}]
[null,{"$f":"IF(INDEX(Objednavka!A:I,607,3)=\"\",INDEX(Objednavka!A:I,607,1),INDEX(Objednavka!A:I,607,3))","v":0},null,null,null,null,null,{"$f":"INDEX(Objednavka!A:I,607,4)","v":0},null,{"$f":"INDEX(Objednavka!A:I,607,5)","v":0},{"$f":"INDEX(Objednavka!A:I,607,7)","v":0},{"$f":"INDEX(Objednavka!A:I,607,8)","v":0},null,{"$f":"IF(INDEX(Objednavka!A:J,607,10)=\"\",\"\",INDEX(Objednavka!A:J,607,10))","v":""}]
[null,{"$f":"IF(INDEX(Objednavka!A:I,608,3)=\"\",INDEX(Objednavka!A:I,608,1),INDEX(Objednavka!A:I,608,3))","v":0},null,null,null,null,null,{"$f":"INDEX(Objednavka!A:I,608,4)","v":0},null,{"$f":"INDEX(Objednavka!A:I,608,5)","v":0},{"$f":"INDEX(Objednavka!A:I,608,7)","v":0},{"$f":"INDEX(Objednavka!A:I,608,8)","v":0},null,{"$f":"IF(INDEX(Objednavka!A:J,608,10)=\"\",\"\",INDEX(Objednavka!A:J,608,10))","v":""}]
[null,{"$f":"IF(INDEX(Objednavka!A:I,609,3)=\"\",INDEX(Objednavka!A:I,609,1),INDEX(Objednavka!A:I,609,3))","v":0},null,null,null,null,null,{"$f":"INDEX(Objednavka!A:I,609,4)","v":0},null,{"$f":"INDEX(Objednavka!A:I,609,5)","v":0},{"$f":"INDEX(Objednavka!A:I,609,7)","v":0},{"$f":"INDEX(Objednavka!A:I,609,8)","v":0},null,{"$f":"IF(INDEX(Objednavka!A:J,609,10)=\"\",\"\",INDEX(Objednavka!A:J,609,10))","v":""}]
[null,{"$f":"IF(INDEX(Objednavka!A:I,610,3)=\"\",INDEX(Objednavka!A:I,610,1),INDEX(Objednavka!A:I,610,3))","v":0},null,null,null,null,null,{"$f":"INDEX(Objednavka!A:I,610,4)","v":0},null,{"$f":"INDEX(Objednavka!A:I,610,5)","v":0},{"$f":"INDEX(Objednavka!A:I,610,7)","v":0},{"$f":"INDEX(Objednavka!A:I,610,8)","v":0},null,{"$f":"IF(INDEX(Objednavka!A:J,610,10)=\"\",\"\",INDEX(Objednavka!A:J,610,10))","v":""}]
[null,{"$f":"IF(INDEX(Objednavka!A:I,611,3)=\"\",INDEX(Objednavka!A:I,611,1),INDEX(Objednavka!A:I,611,3))","v":0},null,null,null,null,null,{"$f":"INDEX(Objednavka!A:I,611,4)","v":0},null,{"$f":"INDEX(Objednavka!A:I,611,5)","v":0},{"$f":"INDEX(Objednavka!A:I,611,7)","v":0},{"$f":"INDEX(Objednavka!A:I,611,8)","v":0},null,{"$f":"IF(INDEX(Objednavka!A:J,611,10)=\"\",\"\",INDEX(Objednavka!A:J,611,10))","v":""}]
[null,{"$f":"IF(INDEX(Objednavka!A:I,612,3)=\"\",INDEX(Objednavka!A:I,612,1),INDEX(Objednavka!A:I,612,3))","v":0},null,null,null,null,null,{"$f":"INDEX(Objednavka!A:I,612,4)","v":0},null,{"$f":"INDEX(Objednavka!A:I,612,5)","v":0},{"$f":"INDEX(Objednavka!A:I,612,7)","v":0},{"$f":"INDEX(Objednavka!A:I,612,8)","v":0},null,{"$f":"IF(INDEX(Objednavka!A:J,612,10)=\"\",\"\",INDEX(Objednavka!A:J,612,10))","v":""}]
[null,{"$f":"IF(INDEX(Objednavka!A:I,613,3)=\"\",INDEX(Objednavka!A:I,613,1),INDEX(Objednavka!A:I,613,3))","v":0},null,null,null,null,null,{"$f":"INDEX(Objednavka!A:I,613,4)","v":0},null,{"$f":"INDEX(Objednavka!A:I,613,5)","v":0},{"$f":"INDEX(Objednavka!A:I,613,7)","v":0},{"$f":"INDEX(Objednavka!A:I,613,8)","v":0},null,{"$f":"IF(INDEX(Objednavka!A:J,613,10)=\"\",\"\",INDEX(Objednavka!A:J,613,10))","v":""}]
[null,{"$f":"IF(INDEX(Objednavka!A:I,614,3)=\"\",INDEX(Objednavka!A:I,614,1),INDEX(Objednavka!A:I,614,3))","v":0},null,null,null,null,null,{"$f":"INDEX(Objednavka!A:I,614,4)","v":0},null,{"$f":"INDEX(Objednavka!A:I,614,5)","v":0},{"$f":"INDEX(Objednavka!A:I,614,7)","v":0},{"$f":"INDEX(Objednavka!A:I,614,8)","v":0},null,{"$f":"IF(INDEX(Objednavka!A:J,614,10)=\"\",\"\",INDEX(Objednavka!A:J,614,10))","v":""}]
[null,{"$f":"IF(INDEX(Objednavka!A:I,615,3)=\"\",INDEX(Objednavka!A:I,615,1),INDEX(Objednavka!A:I,615,3))","v":0},null,null,null,null,null,{"$f":"INDEX(Objednavka!A:I,615,4)","v":0},null,{"$f":"INDEX(Objednavka!A:I,615,5)","v":0},{"$f":"INDEX(Objednavka!A:I,615,7)","v":0},{"$f":"INDEX(Objednavka!A:I,615,8)","v":0},null,{"$f":"IF(INDEX(Objednavka!A:J,615,10)=\"\",\"\",INDEX(Objednavka!A:J,615,10))","v":""}]
[null,{"$f":"IF(INDEX(Objednavka!A:I,616,3)=\"\",INDEX(Objednavka!A:I,616,1),INDEX(Objednavka!A:I,616,3))","v":0},null,null,null,null,null,{"$f":"INDEX(Objednavka!A:I,616,4)","v":0},null,{"$f":"INDEX(Objednavka!A:I,616,5)","v":0},{"$f":"INDEX(Objednavka!A:I,616,7)","v":0},{"$f":"INDEX(Objednavka!A:I,616,8)","v":0},null,{"$f":"IF(INDEX(Objednavka!A:J,616,10)=\"\",\"\",INDEX(Objednavka!A:J,616,10))","v":""}]
[null,{"$f":"IF(INDEX(Objednavka!A:I,617,3)=\"\",INDEX(Objednavka!A:I,617,1),INDEX(Objednavka!A:I,617,3))","v":0},null,null,null,null,null,{"$f":"INDEX(Objednavka!A:I,617,4)","v":0},null,{"$f":"INDEX(Objednavka!A:I,617,5)","v":0},{"$f":"INDEX(Objednavka!A:I,617,7)","v":0},{"$f":"INDEX(Objednavka!A:I,617,8)","v":0},null,{"$f":"IF(INDEX(Objednavka!A:J,617,10)=\"\",\"\",INDEX(Objednavka!A:J,617,10))","v":""}]
[null,{"$f":"IF(INDEX(Objednavka!A:I,618,3)=\"\",INDEX(Objednavka!A:I,618,1),INDEX(Objednavka!A:I,618,3))","v":0},null,null,null,null,null,{"$f":"INDEX(Objednavka!A:I,618,4)","v":0},null,{"$f":"INDEX(Objednavka!A:I,618,5)","v":0},{"$f":"INDEX(Objednavka!A:I,618,7)","v":0},{"$f":"INDEX(Objednavka!A:I,618,8)","v":0},null,{"$f":"IF(INDEX(Objednavka!A:J,618,10)=\"\",\"\",INDEX(Objednavka!A:J,618,10))","v":""}]
[null,{"$f":"IF(INDEX(Objednavka!A:I,619,3)=\"\",INDEX(Objednavka!A:I,619,1),INDEX(Objednavka!A:I,619,3))","v":0},null,null,null,null,null,{"$f":"INDEX(Objednavka!A:I,619,4)","v":0},null,{"$f":"INDEX(Objednavka!A:I,619,5)","v":0},{"$f":"INDEX(Objednavka!A:I,619,7)","v":0},{"$f":"INDEX(Objednavka!A:I,619,8)","v":0},null,{"$f":"IF(INDEX(Objednavka!A:J,619,10)=\"\",\"\",INDEX(Objednavka!A:J,619,10))","v":""}]
[null,{"$f":"IF(INDEX(Objednavka!A:I,620,3)=\"\",INDEX(Objednavka!A:I,620,1),INDEX(Objednavka!A:I,620,3))","v":0},null,null,null,null,null,{"$f":"INDEX(Objednavka!A:I,620,4)","v":0},null,{"$f":"INDEX(Objednavka!A:I,620,5)","v":0},{"$f":"INDEX(Objednavka!A:I,620,7)","v":0},{"$f":"INDEX(Objednavka!A:I,620,8)","v":0},null,{"$f":"IF(INDEX(Objednavka!A:J,620,10)=\"\",\"\",INDEX(Objednavka!A:J,620,10))","v":""}]
[null,{"$f":"IF(INDEX(Objednavka!A:I,621,3)=\"\",INDEX(Objednavka!A:I,621,1),INDEX(Objednavka!A:I,621,3))","v":0},null,null,null,null,null,{"$f":"INDEX(Objednavka!A:I,621,4)","v":0},null,{"$f":"INDEX(Objednavka!A:I,621,5)","v":0},{"$f":"INDEX(Objednavka!A:I,621,7)","v":0},{"$f":"INDEX(Objednavka!A:I,621,8)","v":0},null,{"$f":"IF(INDEX(Objednavka!A:J,621,10)=\"\",\"\",INDEX(Objednavka!A:J,621,10))","v":""}]
[null,{"$f":"IF(INDEX(Objednavka!A:I,622,3)=\"\",INDEX(Objednavka!A:I,622,1),INDEX(Objednavka!A:I,622,3))","v":0},null,null,null,null,null,{"$f":"INDEX(Objednavka!A:I,622,4)","v":0},null,{"$f":"INDEX(Objednavka!A:I,622,5)","v":0},{"$f":"INDEX(Objednavka!A:I,622,7)","v":0},{"$f":"INDEX(Objednavka!A:I,622,8)","v":0},null,{"$f":"IF(INDEX(Objednavka!A:J,622,10)=\"\",\"\",INDEX(Objednavka!A:J,622,10))","v":""}]
[null,{"$f":"IF(INDEX(Objednavka!A:I,623,3)=\"\",INDEX(Objednavka!A:I,623,1),INDEX(Objednavka!A:I,623,3))","v":0},null,null,null,null,null,{"$f":"INDEX(Objednavka!A:I,623,4)","v":0},null,{"$f":"INDEX(Objednavka!A:I,623,5)","v":0},{"$f":"INDEX(Objednavka!A:I,623,7)","v":0},{"$f":"INDEX(Objednavka!A:I,623,8)","v":0},null,{"$f":"IF(INDEX(Objednavka!A:J,623,10)=\"\",\"\",INDEX(Objednavka!A:J,623,10))","v":""}]
[null,{"$f":"IF(INDEX(Objednavka!A:I,624,3)=\"\",INDEX(Objednavka!A:I,624,1),INDEX(Objednavka!A:I,624,3))","v":0},null,null,null,null,null,{"$f":"INDEX(Objednavka!A:I,624,4)","v":0},null,{"$f":"INDEX(Objednavka!A:I,624,5)","v":0},{"$f":"INDEX(Objednavka!A:I,624,7)","v":0},{"$f":"INDEX(Objednavka!A:I,624,8)","v":0},null,{"$f":"IF(INDEX(Objednavka!A:J,624,10)=\"\",\"\",INDEX(Objednavka!A:J,624,10))","v":""}]
[null,{"$f":"IF(INDEX(Objednavka!A:I,625,3)=\"\",INDEX(Objednavka!A:I,625,1),INDEX(Objednavka!A:I,625,3))","v":0},null,null,null,null,null,{"$f":"INDEX(Objednavka!A:I,625,4)","v":0},null,{"$f":"INDEX(Objednavka!A:I,625,5)","v":0},{"$f":"INDEX(Objednavka!A:I,625,7)","v":0},{"$f":"INDEX(Objednavka!A:I,625,8)","v":0},null,{"$f":"IF(INDEX(Objednavka!A:J,625,10)=\"\",\"\",INDEX(Objednavka!A:J,625,10))","v":""}]
[null,{"$f":"IF(INDEX(Objednavka!A:I,626,3)=\"\",INDEX(Objednavka!A:I,626,1),INDEX(Objednavka!A:I,626,3))","v":0},null,null,null,null,null,{"$f":"INDEX(Objednavka!A:I,626,4)","v":0},null,{"$f":"INDEX(Objednavka!A:I,626,5)","v":0},{"$f":"INDEX(Objednavka!A:I,626,7)","v":0},{"$f":"INDEX(Objednavka!A:I,626,8)","v":0},null,{"$f":"IF(INDEX(Objednavka!A:J,626,10)=\"\",\"\",INDEX(Objednavka!A:J,626,10))","v":""}]
[null,{"$f":"IF(INDEX(Objednavka!A:I,627,3)=\"\",INDEX(Objednavka!A:I,627,1),INDEX(Objednavka!A:I,627,3))","v":0},null,null,null,null,null,{"$f":"INDEX(Objednavka!A:I,627,4)","v":0},null,{"$f":"INDEX(Objednavka!A:I,627,5)","v":0},{"$f":"INDEX(Objednavka!A:I,627,7)","v":0},{"$f":"INDEX(Objednavka!A:I,627,8)","v":0},null,{"$f":"IF(INDEX(Objednavka!A:J,627,10)=\"\",\"\",INDEX(Objednavka!A:J,627,10))","v":""}]
[null,{"$f":"IF(INDEX(Objednavka!A:I,628,3)=\"\",INDEX(Objednavka!A:I,628,1),INDEX(Objednavka!A:I,628,3))","v":0},null,null,null,null,null,{"$f":"INDEX(Objednavka!A:I,628,4)","v":0},null,{"$f":"INDEX(Objednavka!A:I,628,5)","v":0},{"$f":"INDEX(Objednavka!A:I,628,7)","v":0},{"$f":"INDEX(Objednavka!A:I,628,8)","v":0},null,{"$f":"IF(INDEX(Objednavka!A:J,628,10)=\"\",\"\",INDEX(Objednavka!A:J,628,10))","v":""}]
[null,{"$f":"IF(INDEX(Objednavka!A:I,629,3)=\"\",INDEX(Objednavka!A:I,629,1),INDEX(Objednavka!A:I,629,3))","v":0},null,null,null,null,null,{"$f":"INDEX(Objednavka!A:I,629,4)","v":0},null,{"$f":"INDEX(Objednavka!A:I,629,5)","v":0},{"$f":"INDEX(Objednavka!A:I,629,7)","v":0},{"$f":"INDEX(Objednavka!A:I,629,8)","v":0},null,{"$f":"IF(INDEX(Objednavka!A:J,629,10)=\"\",\"\",INDEX(Objednavka!A:J,629,10))","v":""}]
[null,{"$f":"IF(INDEX(Objednavka!A:I,630,3)=\"\",INDEX(Objednavka!A:I,630,1),INDEX(Objednavka!A:I,630,3))","v":0},null,null,null,null,null,{"$f":"INDEX(Objednavka!A:I,630,4)","v":0},null,{"$f":"INDEX(Objednavka!A:I,630,5)","v":0},{"$f":"INDEX(Objednavka!A:I,630,7)","v":0},{"$f":"INDEX(Objednavka!A:I,630,8)","v":0},null,{"$f":"IF(INDEX(Objednavka!A:J,630,10)=\"\",\"\",INDEX(Objednavka!A:J,630,10))","v":""}]
[null,{"$f":"IF(INDEX(Objednavka!A:I,631,3)=\"\",INDEX(Objednavka!A:I,631,1),INDEX(Objednavka!A:I,631,3))","v":0},null,null,null,null,null,{"$f":"INDEX(Objednavka!A:I,631,4)","v":0},null,{"$f":"INDEX(Objednavka!A:I,631,5)","v":0},{"$f":"INDEX(Objednavka!A:I,631,7)","v":0},{"$f":"INDEX(Objednavka!A:I,631,8)","v":0},null,{"$f":"IF(INDEX(Objednavka!A:J,631,10)=\"\",\"\",INDEX(Objednavka!A:J,631,10))","v":""}]
[null,{"$f":"IF(INDEX(Objednavka!A:I,632,3)=\"\",INDEX(Objednavka!A:I,632,1),INDEX(Objednavka!A:I,632,3))","v":0},null,null,null,null,null,{"$f":"INDEX(Objednavka!A:I,632,4)","v":0},null,{"$f":"INDEX(Objednavka!A:I,632,5)","v":0},{"$f":"INDEX(Objednavka!A:I,632,7)","v":0},{"$f":"INDEX(Objednavka!A:I,632,8)","v":0},null,{"$f":"IF(INDEX(Objednavka!A:J,632,10)=\"\",\"\",INDEX(Objednavka!A:J,632,10))","v":""}]
[null,{"$f":"IF(INDEX(Objednavka!A:I,633,3)=\"\",INDEX(Objednavka!A:I,633,1),INDEX(Objednavka!A:I,633,3))","v":0},null,null,null,null,null,{"$f":"INDEX(Objednavka!A:I,633,4)","v":0},null,{"$f":"INDEX(Objednavka!A:I,633,5)","v":0},{"$f":"INDEX(Objednavka!A:I,633,7)","v":0},{"$f":"INDEX(Objednavka!A:I,633,8)","v":0},null,{"$f":"IF(INDEX(Objednavka!A:J,633,10)=\"\",\"\",INDEX(Objednavka!A:J,633,10))","v":""}]
[null,{"$f":"IF(INDEX(Objednavka!A:I,634,3)=\"\",INDEX(Objednavka!A:I,634,1),INDEX(Objednavka!A:I,634,3))","v":0},null,null,null,null,null,{"$f":"INDEX(Objednavka!A:I,634,4)","v":0},null,{"$f":"INDEX(Objednavka!A:I,634,5)","v":0},{"$f":"INDEX(Objednavka!A:I,634,7)","v":0},{"$f":"INDEX(Objednavka!A:I,634,8)","v":0},null,{"$f":"IF(INDEX(Objednavka!A:J,634,10)=\"\",\"\",INDEX(Objednavka!A:J,634,10))","v":""}]
[null,{"$f":"IF(INDEX(Objednavka!A:I,635,3)=\"\",INDEX(Objednavka!A:I,635,1),INDEX(Objednavka!A:I,635,3))","v":0},null,null,null,null,null,{"$f":"INDEX(Objednavka!A:I,635,4)","v":0},null,{"$f":"INDEX(Objednavka!A:I,635,5)","v":0},{"$f":"INDEX(Objednavka!A:I,635,7)","v":0},{"$f":"INDEX(Objednavka!A:I,635,8)","v":0},null,{"$f":"IF(INDEX(Objednavka!A:J,635,10)=\"\",\"\",INDEX(Objednavka!A:J,635,10))","v":""}]
[null,{"$f":"IF(INDEX(Objednavka!A:I,636,3)=\"\",INDEX(Objednavka!A:I,636,1),INDEX(Objednavka!A:I,636,3))","v":0},null,null,null,null,null,{"$f":"INDEX(Objednavka!A:I,636,4)","v":0},null,{"$f":"INDEX(Objednavka!A:I,636,5)","v":0},{"$f":"INDEX(Objednavka!A:I,636,7)","v":0},{"$f":"INDEX(Objednavka!A:I,636,8)","v":0},null,{"$f":"IF(INDEX(Objednavka!A:J,636,10)=\"\",\"\",INDEX(Objednavka!A:J,636,10))","v":""}]
[null,{"$f":"IF(INDEX(Objednavka!A:I,637,3)=\"\",INDEX(Objednavka!A:I,637,1),INDEX(Objednavka!A:I,637,3))","v":0},null,null,null,null,null,{"$f":"INDEX(Objednavka!A:I,637,4)","v":0},null,{"$f":"INDEX(Objednavka!A:I,637,5)","v":0},{"$f":"INDEX(Objednavka!A:I,637,7)","v":0},{"$f":"INDEX(Objednavka!A:I,637,8)","v":0},null,{"$f":"IF(INDEX(Objednavka!A:J,637,10)=\"\",\"\",INDEX(Objednavka!A:J,637,10))","v":""}]
[null,{"$f":"IF(INDEX(Objednavka!A:I,638,3)=\"\",INDEX(Objednavka!A:I,638,1),INDEX(Objednavka!A:I,638,3))","v":0},null,null,null,null,null,{"$f":"INDEX(Objednavka!A:I,638,4)","v":0},null,{"$f":"INDEX(Objednavka!A:I,638,5)","v":0},{"$f":"INDEX(Objednavka!A:I,638,7)","v":0},{"$f":"INDEX(Objednavka!A:I,638,8)","v":0},null,{"$f":"IF(INDEX(Objednavka!A:J,638,10)=\"\",\"\",INDEX(Objednavka!A:J,638,10))","v":""}]
[null,{"$f":"IF(INDEX(Objednavka!A:I,639,3)=\"\",INDEX(Objednavka!A:I,639,1),INDEX(Objednavka!A:I,639,3))","v":0},null,null,null,null,null,{"$f":"INDEX(Objednavka!A:I,639,4)","v":0},null,{"$f":"INDEX(Objednavka!A:I,639,5)","v":0},{"$f":"INDEX(Objednavka!A:I,639,7)","v":0},{"$f":"INDEX(Objednavka!A:I,639,8)","v":0},null,{"$f":"IF(INDEX(Objednavka!A:J,639,10)=\"\",\"\",INDEX(Objednavka!A:J,639,10))","v":""}]
[null,{"$f":"IF(INDEX(Objednavka!A:I,640,3)=\"\",INDEX(Objednavka!A:I,640,1),INDEX(Objednavka!A:I,640,3))","v":0},null,null,null,null,null,{"$f":"INDEX(Objednavka!A:I,640,4)","v":0},null,{"$f":"INDEX(Objednavka!A:I,640,5)","v":0},{"$f":"INDEX(Objednavka!A:I,640,7)","v":0},{"$f":"INDEX(Objednavka!A:I,640,8)","v":0},null,{"$f":"IF(INDEX(Objednavka!A:J,640,10)=\"\",\"\",INDEX(Objednavka!A:J,640,10))","v":""}]
[null,{"$f":"IF(INDEX(Objednavka!A:I,641,3)=\"\",INDEX(Objednavka!A:I,641,1),INDEX(Objednavka!A:I,641,3))","v":0},null,null,null,null,null,{"$f":"INDEX(Objednavka!A:I,641,4)","v":0},null,{"$f":"INDEX(Objednavka!A:I,641,5)","v":0},{"$f":"INDEX(Objednavka!A:I,641,7)","v":0},{"$f":"INDEX(Objednavka!A:I,641,8)","v":0},null,{"$f":"IF(INDEX(Objednavka!A:J,641,10)=\"\",\"\",INDEX(Objednavka!A:J,641,10))","v":""}]
[null,{"$f":"IF(INDEX(Objednavka!A:I,642,3)=\"\",INDEX(Objednavka!A:I,642,1),INDEX(Objednavka!A:I,642,3))","v":0},null,null,null,null,null,{"$f":"INDEX(Objednavka!A:I,642,4)","v":0},null,{"$f":"INDEX(Objednavka!A:I,642,5)","v":0},{"$f":"INDEX(Objednavka!A:I,642,7)","v":0},{"$f":"INDEX(Objednavka!A:I,642,8)","v":0},null,{"$f":"IF(INDEX(Objednavka!A:J,642,10)=\"\",\"\",INDEX(Objednavka!A:J,642,10))","v":""}]
[null,{"$f":"IF(INDEX(Objednavka!A:I,643,3)=\"\",INDEX(Objednavka!A:I,643,1),INDEX(Objednavka!A:I,643,3))","v":0},null,null,null,null,null,{"$f":"INDEX(Objednavka!A:I,643,4)","v":0},null,{"$f":"INDEX(Objednavka!A:I,643,5)","v":0},{"$f":"INDEX(Objednavka!A:I,643,7)","v":0},{"$f":"INDEX(Objednavka!A:I,643,8)","v":0},null,{"$f":"IF(INDEX(Objednavka!A:J,643,10)=\"\",\"\",INDEX(Objednavka!A:J,643,10))","v":""}]
[null,{"$f":"IF(INDEX(Objednavka!A:I,644,3)=\"\",INDEX(Objednavka!A:I,644,1),INDEX(Objednavka!A:I,644,3))","v":0},null,null,null,null,null,{"$f":"INDEX(Objednavka!A:I,644,4)","v":0},null,{"$f":"INDEX(Objednavka!A:I,644,5)","v":0},{"$f":"INDEX(Objednavka!A:I,644,7)","v":0},{"$f":"INDEX(Objednavka!A:I,644,8)","v":0},null,{"$f":"IF(INDEX(Objednavka!A:J,644,10)=\"\",\"\",INDEX(Objednavka!A:J,644,10))","v":""}]
[null,{"$f":"IF(INDEX(Objednavka!A:I,645,3)=\"\",INDEX(Objednavka!A:I,645,1),INDEX(Objednavka!A:I,645,3))","v":0},null,null,null,null,null,{"$f":"INDEX(Objednavka!A:I,645,4)","v":0},null,{"$f":"INDEX(Objednavka!A:I,645,5)","v":0},{"$f":"INDEX(Objednavka!A:I,645,7)","v":0},{"$f":"INDEX(Objednavka!A:I,645,8)","v":0},null,{"$f":"IF(INDEX(Objednavka!A:J,645,10)=\"\",\"\",INDEX(Objednavka!A:J,645,10))","v":""}]
[null,{"$f":"IF(INDEX(Objednavka!A:I,646,3)=\"\",INDEX(Objednavka!A:I,646,1),INDEX(Objednavka!A:I,646,3))","v":0},null,null,null,null,null,{"$f":"INDEX(Objednavka!A:I,646,4)","v":0},null,{"$f":"INDEX(Objednavka!A:I,646,5)","v":0},{"$f":"INDEX(Objednavka!A:I,646,7)","v":0},{"$f":"INDEX(Objednavka!A:I,646,8)","v":0},null,{"$f":"IF(INDEX(Objednavka!A:J,646,10)=\"\",\"\",INDEX(Objednavka!A:J,646,10))","v":""}]
[null,{"$f":"IF(INDEX(Objednavka!A:I,647,3)=\"\",INDEX(Objednavka!A:I,647,1),INDEX(Objednavka!A:I,647,3))","v":0},null,null,null,null,null,{"$f":"INDEX(Objednavka!A:I,647,4)","v":0},null,{"$f":"INDEX(Objednavka!A:I,647,5)","v":0},{"$f":"INDEX(Objednavka!A:I,647,7)","v":0},{"$f":"INDEX(Objednavka!A:I,647,8)","v":0},null,{"$f":"IF(INDEX(Objednavka!A:J,647,10)=\"\",\"\",INDEX(Objednavka!A:J,647,10))","v":""}]
[null,{"$f":"IF(INDEX(Objednavka!A:I,648,3)=\"\",INDEX(Objednavka!A:I,648,1),INDEX(Objednavka!A:I,648,3))","v":0},null,null,null,null,null,{"$f":"INDEX(Objednavka!A:I,648,4)","v":0},null,{"$f":"INDEX(Objednavka!A:I,648,5)","v":0},{"$f":"INDEX(Objednavka!A:I,648,7)","v":0},{"$f":"INDEX(Objednavka!A:I,648,8)","v":0},null,{"$f":"IF(INDEX(Objednavka!A:J,648,10)=\"\",\"\",INDEX(Objednavka!A:J,648,10))","v":""}]
[null,{"$f":"IF(INDEX(Objednavka!A:I,649,3)=\"\",INDEX(Objednavka!A:I,649,1),INDEX(Objednavka!A:I,649,3))","v":0},null,null,null,null,null,{"$f":"INDEX(Objednavka!A:I,649,4)","v":0},null,{"$f":"INDEX(Objednavka!A:I,649,5)","v":0},{"$f":"INDEX(Objednavka!A:I,649,7)","v":0},{"$f":"INDEX(Objednavka!A:I,649,8)","v":0},null,{"$f":"IF(INDEX(Objednavka!A:J,649,10)=\"\",\"\",INDEX(Objednavka!A:J,649,10))","v":""}]
[null,{"$f":"IF(INDEX(Objednavka!A:I,650,3)=\"\",INDEX(Objednavka!A:I,650,1),INDEX(Objednavka!A:I,650,3))","v":0},null,null,null,null,null,{"$f":"INDEX(Objednavka!A:I,650,4)","v":0},null,{"$f":"INDEX(Objednavka!A:I,650,5)","v":0},{"$f":"INDEX(Objednavka!A:I,650,7)","v":0},{"$f":"INDEX(Objednavka!A:I,650,8)","v":0},null,{"$f":"IF(INDEX(Objednavka!A:J,650,10)=\"\",\"\",INDEX(Objednavka!A:J,650,10))","v":""}]
[null,{"$f":"IF(INDEX(Objednavka!A:I,651,3)=\"\",INDEX(Objednavka!A:I,651,1),INDEX(Objednavka!A:I,651,3))","v":0},null,null,null,null,null,{"$f":"INDEX(Objednavka!A:I,651,4)","v":0},null,{"$f":"INDEX(Objednavka!A:I,651,5)","v":0},{"$f":"INDEX(Objednavka!A:I,651,7)","v":0},{"$f":"INDEX(Objednavka!A:I,651,8)","v":0},null,{"$f":"IF(INDEX(Objednavka!A:J,651,10)=\"\",\"\",INDEX(Objednavka!A:J,651,10))","v":""}]
[null,{"$f":"IF(INDEX(Objednavka!A:I,652,3)=\"\",INDEX(Objednavka!A:I,652,1),INDEX(Objednavka!A:I,652,3))","v":0},null,null,null,null,null,{"$f":"INDEX(Objednavka!A:I,652,4)","v":0},null,{"$f":"INDEX(Objednavka!A:I,652,5)","v":0},{"$f":"INDEX(Objednavka!A:I,652,7)","v":0},{"$f":"INDEX(Objednavka!A:I,652,8)","v":0},null,{"$f":"IF(INDEX(Objednavka!A:J,652,10)=\"\",\"\",INDEX(Objednavka!A:J,652,10))","v":""}]
[null,{"$f":"IF(INDEX(Objednavka!A:I,653,3)=\"\",INDEX(Objednavka!A:I,653,1),INDEX(Objednavka!A:I,653,3))","v":0},null,null,null,null,null,{"$f":"INDEX(Objednavka!A:I,653,4)","v":0},null,{"$f":"INDEX(Objednavka!A:I,653,5)","v":0},{"$f":"INDEX(Objednavka!A:I,653,7)","v":0},{"$f":"INDEX(Objednavka!A:I,653,8)","v":0},null,{"$f":"IF(INDEX(Objednavka!A:J,653,10)=\"\",\"\",INDEX(Objednavka!A:J,653,10))","v":""}]
[null,{"$f":"IF(INDEX(Objednavka!A:I,654,3)=\"\",INDEX(Objednavka!A:I,654,1),INDEX(Objednavka!A:I,654,3))","v":0},null,null,null,null,null,{"$f":"INDEX(Objednavka!A:I,654,4)","v":0},null,{"$f":"INDEX(Objednavka!A:I,654,5)","v":0},{"$f":"INDEX(Objednavka!A:I,654,7)","v":0},{"$f":"INDEX(Objednavka!A:I,654,8)","v":0},null,{"$f":"IF(INDEX(Objednavka!A:J,654,10)=\"\",\"\",INDEX(Objednavka!A:J,654,10))","v":""}]
[null,{"$f":"IF(INDEX(Objednavka!A:I,655,3)=\"\",INDEX(Objednavka!A:I,655,1),INDEX(Objednavka!A:I,655,3))","v":0},null,null,null,null,null,{"$f":"INDEX(Objednavka!A:I,655,4)","v":0},null,{"$f":"INDEX(Objednavka!A:I,655,5)","v":0},{"$f":"INDEX(Objednavka!A:I,655,7)","v":0},{"$f":"INDEX(Objednavka!A:I,655,8)","v":0},null,{"$f":"IF(INDEX(Objednavka!A:J,655,10)=\"\",\"\",INDEX(Objednavka!A:J,655,10))","v":""}]
[null,{"$f":"IF(INDEX(Objednavka!A:I,656,3)=\"\",INDEX(Objednavka!A:I,656,1),INDEX(Objednavka!A:I,656,3))","v":0},null,null,null,null,null,{"$f":"INDEX(Objednavka!A:I,656,4)","v":0},null,{"$f":"INDEX(Objednavka!A:I,656,5)","v":0},{"$f":"INDEX(Objednavka!A:I,656,7)","v":0},{"$f":"INDEX(Objednavka!A:I,656,8)","v":0},null,{"$f":"IF(INDEX(Objednavka!A:J,656,10)=\"\",\"\",INDEX(Objednavka!A:J,656,10))","v":""}]
[null,{"$f":"IF(INDEX(Objednavka!A:I,657,3)=\"\",INDEX(Objednavka!A:I,657,1),INDEX(Objednavka!A:I,657,3))","v":0},null,null,null,null,null,{"$f":"INDEX(Objednavka!A:I,657,4)","v":0},null,{"$f":"INDEX(Objednavka!A:I,657,5)","v":0},{"$f":"INDEX(Objednavka!A:I,657,7)","v":0},{"$f":"INDEX(Objednavka!A:I,657,8)","v":0},null,{"$f":"IF(INDEX(Objednavka!A:J,657,10)=\"\",\"\",INDEX(Objednavka!A:J,657,10))","v":""}]
[null,{"$f":"IF(INDEX(Objednavka!A:I,658,3)=\"\",INDEX(Objednavka!A:I,658,1),INDEX(Objednavka!A:I,658,3))","v":0},null,null,null,null,null,{"$f":"INDEX(Objednavka!A:I,658,4)","v":0},null,{"$f":"INDEX(Objednavka!A:I,658,5)","v":0},{"$f":"INDEX(Objednavka!A:I,658,7)","v":0},{"$f":"INDEX(Objednavka!A:I,658,8)","v":0},null,{"$f":"IF(INDEX(Objednavka!A:J,658,10)=\"\",\"\",INDEX(Objednavka!A:J,658,10))","v":""}]
[null,{"$f":"IF(INDEX(Objednavka!A:I,659,3)=\"\",INDEX(Objednavka!A:I,659,1),INDEX(Objednavka!A:I,659,3))","v":0},null,null,null,null,null,{"$f":"INDEX(Objednavka!A:I,659,4)","v":0},null,{"$f":"INDEX(Objednavka!A:I,659,5)","v":0},{"$f":"INDEX(Objednavka!A:I,659,7)","v":0},{"$f":"INDEX(Objednavka!A:I,659,8)","v":0},null,{"$f":"IF(INDEX(Objednavka!A:J,659,10)=\"\",\"\",INDEX(Objednavka!A:J,659,10))","v":""}]
[null,{"$f":"IF(INDEX(Objednavka!A:I,660,3)=\"\",INDEX(Objednavka!A:I,660,1),INDEX(Objednavka!A:I,660,3))","v":0},null,null,null,null,null,{"$f":"INDEX(Objednavka!A:I,660,4)","v":0},null,{"$f":"INDEX(Objednavka!A:I,660,5)","v":0},{"$f":"INDEX(Objednavka!A:I,660,7)","v":0},{"$f":"INDEX(Objednavka!A:I,660,8)","v":0},null,{"$f":"IF(INDEX(Objednavka!A:J,660,10)=\"\",\"\",INDEX(Objednavka!A:J,660,10))","v":""}]
[null,{"$f":"IF(INDEX(Objednavka!A:I,661,3)=\"\",INDEX(Objednavka!A:I,661,1),INDEX(Objednavka!A:I,661,3))","v":0},null,null,null,null,null,{"$f":"INDEX(Objednavka!A:I,661,4)","v":0},null,{"$f":"INDEX(Objednavka!A:I,661,5)","v":0},{"$f":"INDEX(Objednavka!A:I,661,7)","v":0},{"$f":"INDEX(Objednavka!A:I,661,8)","v":0},null,{"$f":"IF(INDEX(Objednavka!A:J,661,10)=\"\",\"\",INDEX(Objednavka!A:J,661,10))","v":""}]
[null,{"$f":"IF(INDEX(Objednavka!A:I,662,3)=\"\",INDEX(Objednavka!A:I,662,1),INDEX(Objednavka!A:I,662,3))","v":0},null,null,null,null,null,{"$f":"INDEX(Objednavka!A:I,662,4)","v":0},null,{"$f":"INDEX(Objednavka!A:I,662,5)","v":0},{"$f":"INDEX(Objednavka!A:I,662,7)","v":0},{"$f":"INDEX(Objednavka!A:I,662,8)","v":0},null,{"$f":"IF(INDEX(Objednavka!A:J,662,10)=\"\",\"\",INDEX(Objednavka!A:J,662,10))","v":""}]
[null,{"$f":"IF(INDEX(Objednavka!A:I,663,3)=\"\",INDEX(Objednavka!A:I,663,1),INDEX(Objednavka!A:I,663,3))","v":0},null,null,null,null,null,{"$f":"INDEX(Objednavka!A:I,663,4)","v":0},null,{"$f":"INDEX(Objednavka!A:I,663,5)","v":0},{"$f":"INDEX(Objednavka!A:I,663,7)","v":0},{"$f":"INDEX(Objednavka!A:I,663,8)","v":0},null,{"$f":"IF(INDEX(Objednavka!A:J,663,10)=\"\",\"\",INDEX(Objednavka!A:J,663,10))","v":""}]
[null,{"$f":"IF(INDEX(Objednavka!A:I,664,3)=\"\",INDEX(Objednavka!A:I,664,1),INDEX(Objednavka!A:I,664,3))","v":0},null,null,null,null,null,{"$f":"INDEX(Objednavka!A:I,664,4)","v":0},null,{"$f":"INDEX(Objednavka!A:I,664,5)","v":0},{"$f":"INDEX(Objednavka!A:I,664,7)","v":0},{"$f":"INDEX(Objednavka!A:I,664,8)","v":0},null,{"$f":"IF(INDEX(Objednavka!A:J,664,10)=\"\",\"\",INDEX(Objednavka!A:J,664,10))","v":""}]
[null,{"$f":"IF(INDEX(Objednavka!A:I,665,3)=\"\",INDEX(Objednavka!A:I,665,1),INDEX(Objednavka!A:I,665,3))","v":0},null,null,null,null,null,{"$f":"INDEX(Objednavka!A:I,665,4)","v":0},null,{"$f":"INDEX(Objednavka!A:I,665,5)","v":0},{"$f":"INDEX(Objednavka!A:I,665,7)","v":0},{"$f":"INDEX(Objednavka!A:I,665,8)","v":0},null,{"$f":"IF(INDEX(Objednavka!A:J,665,10)=\"\",\"\",INDEX(Objednavka!A:J,665,10))","v":""}]
[null,{"$f":"IF(INDEX(Objednavka!A:I,666,3)=\"\",INDEX(Objednavka!A:I,666,1),INDEX(Objednavka!A:I,666,3))","v":0},null,null,null,null,null,{"$f":"INDEX(Objednavka!A:I,666,4)","v":0},null,{"$f":"INDEX(Objednavka!A:I,666,5)","v":0},{"$f":"INDEX(Objednavka!A:I,666,7)","v":0},{"$f":"INDEX(Objednavka!A:I,666,8)","v":0},null,{"$f":"IF(INDEX(Objednavka!A:J,666,10)=\"\",\"\",INDEX(Objednavka!A:J,666,10))","v":""}]
[null,{"$f":"IF(INDEX(Objednavka!A:I,667,3)=\"\",INDEX(Objednavka!A:I,667,1),INDEX(Objednavka!A:I,667,3))","v":0},null,null,null,null,null,{"$f":"INDEX(Objednavka!A:I,667,4)","v":0},null,{"$f":"INDEX(Objednavka!A:I,667,5)","v":0},{"$f":"INDEX(Objednavka!A:I,667,7)","v":0},{"$f":"INDEX(Objednavka!A:I,667,8)","v":0},null,{"$f":"IF(INDEX(Objednavka!A:J,667,10)=\"\",\"\",INDEX(Objednavka!A:J,667,10))","v":""}]
[null,{"$f":"IF(INDEX(Objednavka!A:I,668,3)=\"\",INDEX(Objednavka!A:I,668,1),INDEX(Objednavka!A:I,668,3))","v":0},null,null,null,null,null,{"$f":"INDEX(Objednavka!A:I,668,4)","v":0},null,{"$f":"INDEX(Objednavka!A:I,668,5)","v":0},{"$f":"INDEX(Objednavka!A:I,668,7)","v":0},{"$f":"INDEX(Objednavka!A:I,668,8)","v":0},null,{"$f":"IF(INDEX(Objednavka!A:J,668,10)=\"\",\"\",INDEX(Objednavka!A:J,668,10))","v":""}]
[null,{"$f":"IF(INDEX(Objednavka!A:I,669,3)=\"\",INDEX(Objednavka!A:I,669,1),INDEX(Objednavka!A:I,669,3))","v":0},null,null,null,null,null,{"$f":"INDEX(Objednavka!A:I,669,4)","v":0},null,{"$f":"INDEX(Objednavka!A:I,669,5)","v":0},{"$f":"INDEX(Objednavka!A:I,669,7)","v":0},{"$f":"INDEX(Objednavka!A:I,669,8)","v":0},null,{"$f":"IF(INDEX(Objednavka!A:J,669,10)=\"\",\"\",INDEX(Objednavka!A:J,669,10))","v":""}]
[null,{"$f":"IF(INDEX(Objednavka!A:I,670,3)=\"\",INDEX(Objednavka!A:I,670,1),INDEX(Objednavka!A:I,670,3))","v":0},null,null,null,null,null,{"$f":"INDEX(Objednavka!A:I,670,4)","v":0},null,{"$f":"INDEX(Objednavka!A:I,670,5)","v":0},{"$f":"INDEX(Objednavka!A:I,670,7)","v":0},{"$f":"INDEX(Objednavka!A:I,670,8)","v":0},null,{"$f":"IF(INDEX(Objednavka!A:J,670,10)=\"\",\"\",INDEX(Objednavka!A:J,670,10))","v":""}]
[null,{"$f":"IF(INDEX(Objednavka!A:I,671,3)=\"\",INDEX(Objednavka!A:I,671,1),INDEX(Objednavka!A:I,671,3))","v":0},null,null,null,null,null,{"$f":"INDEX(Objednavka!A:I,671,4)","v":0},null,{"$f":"INDEX(Objednavka!A:I,671,5)","v":0},{"$f":"INDEX(Objednavka!A:I,671,7)","v":0},{"$f":"INDEX(Objednavka!A:I,671,8)","v":0},null,{"$f":"IF(INDEX(Objednavka!A:J,671,10)=\"\",\"\",INDEX(Objednavka!A:J,671,10))","v":""}]
[null,{"$f":"IF(INDEX(Objednavka!A:I,672,3)=\"\",INDEX(Objednavka!A:I,672,1),INDEX(Objednavka!A:I,672,3))","v":0},null,null,null,null,null,{"$f":"INDEX(Objednavka!A:I,672,4)","v":0},null,{"$f":"INDEX(Objednavka!A:I,672,5)","v":0},{"$f":"INDEX(Objednavka!A:I,672,7)","v":0},{"$f":"INDEX(Objednavka!A:I,672,8)","v":0},null,{"$f":"IF(INDEX(Objednavka!A:J,672,10)=\"\",\"\",INDEX(Objednavka!A:J,672,10))","v":""}]
[null,{"$f":"IF(INDEX(Objednavka!A:I,673,3)=\"\",INDEX(Objednavka!A:I,673,1),INDEX(Objednavka!A:I,673,3))","v":0},null,null,null,null,null,{"$f":"INDEX(Objednavka!A:I,673,4)","v":0},null,{"$f":"INDEX(Objednavka!A:I,673,5)","v":0},{"$f":"INDEX(Objednavka!A:I,673,7)","v":0},{"$f":"INDEX(Objednavka!A:I,673,8)","v":0},null,{"$f":"IF(INDEX(Objednavka!A:J,673,10)=\"\",\"\",INDEX(Objednavka!A:J,673,10))","v":""}]
[null,{"$f":"IF(INDEX(Objednavka!A:I,674,3)=\"\",INDEX(Objednavka!A:I,674,1),INDEX(Objednavka!A:I,674,3))","v":0},null,null,null,null,null,{"$f":"INDEX(Objednavka!A:I,674,4)","v":0},null,{"$f":"INDEX(Objednavka!A:I,674,5)","v":0},{"$f":"INDEX(Objednavka!A:I,674,7)","v":0},{"$f":"INDEX(Objednavka!A:I,674,8)","v":0},null,{"$f":"IF(INDEX(Objednavka!A:J,674,10)=\"\",\"\",INDEX(Objednavka!A:J,674,10))","v":""}]
[null,{"$f":"IF(INDEX(Objednavka!A:I,675,3)=\"\",INDEX(Objednavka!A:I,675,1),INDEX(Objednavka!A:I,675,3))","v":0},null,null,null,null,null,{"$f":"INDEX(Objednavka!A:I,675,4)","v":0},null,{"$f":"INDEX(Objednavka!A:I,675,5)","v":0},{"$f":"INDEX(Objednavka!A:I,675,7)","v":0},{"$f":"INDEX(Objednavka!A:I,675,8)","v":0},null,{"$f":"IF(INDEX(Objednavka!A:J,675,10)=\"\",\"\",INDEX(Objednavka!A:J,675,10))","v":""}]
[null,{"$f":"IF(INDEX(Objednavka!A:I,676,3)=\"\",INDEX(Objednavka!A:I,676,1),INDEX(Objednavka!A:I,676,3))","v":0},null,null,null,null,null,{"$f":"INDEX(Objednavka!A:I,676,4)","v":0},null,{"$f":"INDEX(Objednavka!A:I,676,5)","v":0},{"$f":"INDEX(Objednavka!A:I,676,7)","v":0},{"$f":"INDEX(Objednavka!A:I,676,8)","v":0},null,{"$f":"IF(INDEX(Objednavka!A:J,676,10)=\"\",\"\",INDEX(Objednavka!A:J,676,10))","v":""}]
[null,{"$f":"IF(INDEX(Objednavka!A:I,677,3)=\"\",INDEX(Objednavka!A:I,677,1),INDEX(Objednavka!A:I,677,3))","v":0},null,null,null,null,null,{"$f":"INDEX(Objednavka!A:I,677,4)","v":0},null,{"$f":"INDEX(Objednavka!A:I,677,5)","v":0},{"$f":"INDEX(Objednavka!A:I,677,7)","v":0},{"$f":"INDEX(Objednavka!A:I,677,8)","v":0},null,{"$f":"IF(INDEX(Objednavka!A:J,677,10)=\"\",\"\",INDEX(Objednavka!A:J,677,10))","v":""}]
[null,{"$f":"IF(INDEX(Objednavka!A:I,678,3)=\"\",INDEX(Objednavka!A:I,678,1),INDEX(Objednavka!A:I,678,3))","v":0},null,null,null,null,null,{"$f":"INDEX(Objednavka!A:I,678,4)","v":0},null,{"$f":"INDEX(Objednavka!A:I,678,5)","v":0},{"$f":"INDEX(Objednavka!A:I,678,7)","v":0},{"$f":"INDEX(Objednavka!A:I,678,8)","v":0},null,{"$f":"IF(INDEX(Objednavka!A:J,678,10)=\"\",\"\",INDEX(Objednavka!A:J,678,10))","v":""}]
[null,{"$f":"IF(INDEX(Objednavka!A:I,679,3)=\"\",INDEX(Objednavka!A:I,679,1),INDEX(Objednavka!A:I,679,3))","v":0},null,null,null,null,null,{"$f":"INDEX(Objednavka!A:I,679,4)","v":0},null,{"$f":"INDEX(Objednavka!A:I,679,5)","v":0},{"$f":"INDEX(Objednavka!A:I,679,7)","v":0},{"$f":"INDEX(Objednavka!A:I,679,8)","v":0},null,{"$f":"IF(INDEX(Objednavka!A:J,679,10)=\"\",\"\",INDEX(Objednavka!A:J,679,10))","v":""}]
[null,{"$f":"IF(INDEX(Objednavka!A:I,680,3)=\"\",INDEX(Objednavka!A:I,680,1),INDEX(Objednavka!A:I,680,3))","v":0},null,null,null,null,null,{"$f":"INDEX(Objednavka!A:I,680,4)","v":0},null,{"$f":"INDEX(Objednavka!A:I,680,5)","v":0},{"$f":"INDEX(Objednavka!A:I,680,7)","v":0},{"$f":"INDEX(Objednavka!A:I,680,8)","v":0},null,{"$f":"IF(INDEX(Objednavka!A:J,680,10)=\"\",\"\",INDEX(Objednavka!A:J,680,10))","v":""}]
[null,{"$f":"IF(INDEX(Objednavka!A:I,681,3)=\"\",INDEX(Objednavka!A:I,681,1),INDEX(Objednavka!A:I,681,3))","v":0},null,null,null,null,null,{"$f":"INDEX(Objednavka!A:I,681,4)","v":0},null,{"$f":"INDEX(Objednavka!A:I,681,5)","v":0},{"$f":"INDEX(Objednavka!A:I,681,7)","v":0},{"$f":"INDEX(Objednavka!A:I,681,8)","v":0},null,{"$f":"IF(INDEX(Objednavka!A:J,681,10)=\"\",\"\",INDEX(Objednavka!A:J,681,10))","v":""}]
[null,{"$f":"IF(INDEX(Objednavka!A:I,682,3)=\"\",INDEX(Objednavka!A:I,682,1),INDEX(Objednavka!A:I,682,3))","v":0},null,null,null,null,null,{"$f":"INDEX(Objednavka!A:I,682,4)","v":0},null,{"$f":"INDEX(Objednavka!A:I,682,5)","v":0},{"$f":"INDEX(Objednavka!A:I,682,7)","v":0},{"$f":"INDEX(Objednavka!A:I,682,8)","v":0},null,{"$f":"IF(INDEX(Objednavka!A:J,682,10)=\"\",\"\",INDEX(Objednavka!A:J,682,10))","v":""}]
[null,{"$f":"IF(INDEX(Objednavka!A:I,683,3)=\"\",INDEX(Objednavka!A:I,683,1),INDEX(Objednavka!A:I,683,3))","v":0},null,null,null,null,null,{"$f":"INDEX(Objednavka!A:I,683,4)","v":0},null,{"$f":"INDEX(Objednavka!A:I,683,5)","v":0},{"$f":"INDEX(Objednavka!A:I,683,7)","v":0},{"$f":"INDEX(Objednavka!A:I,683,8)","v":0},null,{"$f":"IF(INDEX(Objednavka!A:J,683,10)=\"\",\"\",INDEX(Objednavka!A:J,683,10))","v":""}]
[null,{"$f":"IF(INDEX(Objednavka!A:I,684,3)=\"\",INDEX(Objednavka!A:I,684,1),INDEX(Objednavka!A:I,684,3))","v":0},null,null,null,null,null,{"$f":"INDEX(Objednavka!A:I,684,4)","v":0},null,{"$f":"INDEX(Objednavka!A:I,684,5)","v":0},{"$f":"INDEX(Objednavka!A:I,684,7)","v":0},{"$f":"INDEX(Objednavka!A:I,684,8)","v":0},null,{"$f":"IF(INDEX(Objednavka!A:J,684,10)=\"\",\"\",INDEX(Objednavka!A:J,684,10))","v":""}]
[null,{"$f":"IF(INDEX(Objednavka!A:I,685,3)=\"\",INDEX(Objednavka!A:I,685,1),INDEX(Objednavka!A:I,685,3))","v":0},null,null,null,null,null,{"$f":"INDEX(Objednavka!A:I,685,4)","v":0},null,{"$f":"INDEX(Objednavka!A:I,685,5)","v":0},{"$f":"INDEX(Objednavka!A:I,685,7)","v":0},{"$f":"INDEX(Objednavka!A:I,685,8)","v":0},null,{"$f":"IF(INDEX(Objednavka!A:J,685,10)=\"\",\"\",INDEX(Objednavka!A:J,685,10))","v":""}]
[null,{"$f":"IF(INDEX(Objednavka!A:I,686,3)=\"\",INDEX(Objednavka!A:I,686,1),INDEX(Objednavka!A:I,686,3))","v":0},null,null,null,null,null,{"$f":"INDEX(Objednavka!A:I,686,4)","v":0},null,{"$f":"INDEX(Objednavka!A:I,686,5)","v":0},{"$f":"INDEX(Objednavka!A:I,686,7)","v":0},{"$f":"INDEX(Objednavka!A:I,686,8)","v":0},null,{"$f":"IF(INDEX(Objednavka!A:J,686,10)=\"\",\"\",INDEX(Objednavka!A:J,686,10))","v":""}]
[null,{"$f":"IF(INDEX(Objednavka!A:I,687,3)=\"\",INDEX(Objednavka!A:I,687,1),INDEX(Objednavka!A:I,687,3))","v":0},null,null,null,null,null,{"$f":"INDEX(Objednavka!A:I,687,4)","v":0},null,{"$f":"INDEX(Objednavka!A:I,687,5)","v":0},{"$f":"INDEX(Objednavka!A:I,687,7)","v":0},{"$f":"INDEX(Objednavka!A:I,687,8)","v":0},null,{"$f":"IF(INDEX(Objednavka!A:J,687,10)=\"\",\"\",INDEX(Objednavka!A:J,687,10))","v":""}]
[null,{"$f":"IF(INDEX(Objednavka!A:I,688,3)=\"\",INDEX(Objednavka!A:I,688,1),INDEX(Objednavka!A:I,688,3))","v":0},null,null,null,null,null,{"$f":"INDEX(Objednavka!A:I,688,4)","v":0},null,{"$f":"INDEX(Objednavka!A:I,688,5)","v":0},{"$f":"INDEX(Objednavka!A:I,688,7)","v":0},{"$f":"INDEX(Objednavka!A:I,688,8)","v":0},null,{"$f":"IF(INDEX(Objednavka!A:J,688,10)=\"\",\"\",INDEX(Objednavka!A:J,688,10))","v":""}]
[null,{"$f":"IF(INDEX(Objednavka!A:I,689,3)=\"\",INDEX(Objednavka!A:I,689,1),INDEX(Objednavka!A:I,689,3))","v":0},null,null,null,null,null,{"$f":"INDEX(Objednavka!A:I,689,4)","v":0},null,{"$f":"INDEX(Objednavka!A:I,689,5)","v":0},{"$f":"INDEX(Objednavka!A:I,689,7)","v":0},{"$f":"INDEX(Objednavka!A:I,689,8)","v":0},null,{"$f":"IF(INDEX(Objednavka!A:J,689,10)=\"\",\"\",INDEX(Objednavka!A:J,689,10))","v":""}]
[null,{"$f":"IF(INDEX(Objednavka!A:I,690,3)=\"\",INDEX(Objednavka!A:I,690,1),INDEX(Objednavka!A:I,690,3))","v":0},null,null,null,null,null,{"$f":"INDEX(Objednavka!A:I,690,4)","v":0},null,{"$f":"INDEX(Objednavka!A:I,690,5)","v":0},{"$f":"INDEX(Objednavka!A:I,690,7)","v":0},{"$f":"INDEX(Objednavka!A:I,690,8)","v":0},null,{"$f":"IF(INDEX(Objednavka!A:J,690,10)=\"\",\"\",INDEX(Objednavka!A:J,690,10))","v":""}]
[null,{"$f":"IF(INDEX(Objednavka!A:I,691,3)=\"\",INDEX(Objednavka!A:I,691,1),INDEX(Objednavka!A:I,691,3))","v":0},null,null,null,null,null,{"$f":"INDEX(Objednavka!A:I,691,4)","v":0},null,{"$f":"INDEX(Objednavka!A:I,691,5)","v":0},{"$f":"INDEX(Objednavka!A:I,691,7)","v":0},{"$f":"INDEX(Objednavka!A:I,691,8)","v":0},null,{"$f":"IF(INDEX(Objednavka!A:J,691,10)=\"\",\"\",INDEX(Objednavka!A:J,691,10))","v":""}]
[null,{"$f":"IF(INDEX(Objednavka!A:I,692,3)=\"\",INDEX(Objednavka!A:I,692,1),INDEX(Objednavka!A:I,692,3))","v":0},null,null,null,null,null,{"$f":"INDEX(Objednavka!A:I,692,4)","v":0},null,{"$f":"INDEX(Objednavka!A:I,692,5)","v":0},{"$f":"INDEX(Objednavka!A:I,692,7)","v":0},{"$f":"INDEX(Objednavka!A:I,692,8)","v":0},null,{"$f":"IF(INDEX(Objednavka!A:J,692,10)=\"\",\"\",INDEX(Objednavka!A:J,692,10))","v":""}]
[null,{"$f":"IF(INDEX(Objednavka!A:I,693,3)=\"\",INDEX(Objednavka!A:I,693,1),INDEX(Objednavka!A:I,693,3))","v":0},null,null,null,null,null,{"$f":"INDEX(Objednavka!A:I,693,4)","v":0},null,{"$f":"INDEX(Objednavka!A:I,693,5)","v":0},{"$f":"INDEX(Objednavka!A:I,693,7)","v":0},{"$f":"INDEX(Objednavka!A:I,693,8)","v":0},null,{"$f":"IF(INDEX(Objednavka!A:J,693,10)=\"\",\"\",INDEX(Objednavka!A:J,693,10))","v":""}]
[null,{"$f":"IF(INDEX(Objednavka!A:I,694,3)=\"\",INDEX(Objednavka!A:I,694,1),INDEX(Objednavka!A:I,694,3))","v":0},null,null,null,null,null,{"$f":"INDEX(Objednavka!A:I,694,4)","v":0},null,{"$f":"INDEX(Objednavka!A:I,694,5)","v":0},{"$f":"INDEX(Objednavka!A:I,694,7)","v":0},{"$f":"INDEX(Objednavka!A:I,694,8)","v":0},null,{"$f":"IF(INDEX(Objednavka!A:J,694,10)=\"\",\"\",INDEX(Objednavka!A:J,694,10))","v":""}]
[null,{"$f":"IF(INDEX(Objednavka!A:I,695,3)=\"\",INDEX(Objednavka!A:I,695,1),INDEX(Objednavka!A:I,695,3))","v":0},null,null,null,null,null,{"$f":"INDEX(Objednavka!A:I,695,4)","v":0},null,{"$f":"INDEX(Objednavka!A:I,695,5)","v":0},{"$f":"INDEX(Objednavka!A:I,695,7)","v":0},{"$f":"INDEX(Objednavka!A:I,695,8)","v":0},null,{"$f":"IF(INDEX(Objednavka!A:J,695,10)=\"\",\"\",INDEX(Objednavka!A:J,695,10))","v":""}]
[null,{"$f":"IF(INDEX(Objednavka!A:I,696,3)=\"\",INDEX(Objednavka!A:I,696,1),INDEX(Objednavka!A:I,696,3))","v":0},null,null,null,null,null,{"$f":"INDEX(Objednavka!A:I,696,4)","v":0},null,{"$f":"INDEX(Objednavka!A:I,696,5)","v":0},{"$f":"INDEX(Objednavka!A:I,696,7)","v":0},{"$f":"INDEX(Objednavka!A:I,696,8)","v":0},null,{"$f":"IF(INDEX(Objednavka!A:J,696,10)=\"\",\"\",INDEX(Objednavka!A:J,696,10))","v":""}]
[null,{"$f":"IF(INDEX(Objednavka!A:I,697,3)=\"\",INDEX(Objednavka!A:I,697,1),INDEX(Objednavka!A:I,697,3))","v":0},null,null,null,null,null,{"$f":"INDEX(Objednavka!A:I,697,4)","v":0},null,{"$f":"INDEX(Objednavka!A:I,697,5)","v":0},{"$f":"INDEX(Objednavka!A:I,697,7)","v":0},{"$f":"INDEX(Objednavka!A:I,697,8)","v":0},null,{"$f":"IF(INDEX(Objednavka!A:J,697,10)=\"\",\"\",INDEX(Objednavka!A:J,697,10))","v":""}]
[null,{"$f":"IF(INDEX(Objednavka!A:I,698,3)=\"\",INDEX(Objednavka!A:I,698,1),INDEX(Objednavka!A:I,698,3))","v":0},null,null,null,null,null,{"$f":"INDEX(Objednavka!A:I,698,4)","v":0},null,{"$f":"INDEX(Objednavka!A:I,698,5)","v":0},{"$f":"INDEX(Objednavka!A:I,698,7)","v":0},{"$f":"INDEX(Objednavka!A:I,698,8)","v":0},null,{"$f":"IF(INDEX(Objednavka!A:J,698,10)=\"\",\"\",INDEX(Objednavka!A:J,698,10))","v":""}]
[null,{"$f":"IF(INDEX(Objednavka!A:I,699,3)=\"\",INDEX(Objednavka!A:I,699,1),INDEX(Objednavka!A:I,699,3))","v":0},null,null,null,null,null,{"$f":"INDEX(Objednavka!A:I,699,4)","v":0},null,{"$f":"INDEX(Objednavka!A:I,699,5)","v":0},{"$f":"INDEX(Objednavka!A:I,699,7)","v":0},{"$f":"INDEX(Objednavka!A:I,699,8)","v":0},null,{"$f":"IF(INDEX(Objednavka!A:J,699,10)=\"\",\"\",INDEX(Objednavka!A:J,699,10))","v":""}]
[null,{"$f":"IF(INDEX(Objednavka!A:I,700,3)=\"\",INDEX(Objednavka!A:I,700,1),INDEX(Objednavka!A:I,700,3))","v":0},null,null,null,null,null,{"$f":"INDEX(Objednavka!A:I,700,4)","v":0},null,{"$f":"INDEX(Objednavka!A:I,700,5)","v":0},{"$f":"INDEX(Objednavka!A:I,700,7)","v":0},{"$f":"INDEX(Objednavka!A:I,700,8)","v":0},null,{"$f":"IF(INDEX(Objednavka!A:J,700,10)=\"\",\"\",INDEX(Objednavka!A:J,700,10))","v":""}]
[null,{"$f":"IF(INDEX(Objednavka!A:I,701,3)=\"\",INDEX(Objednavka!A:I,701,1),INDEX(Objednavka!A:I,701,3))","v":0},null,null,null,null,null,{"$f":"INDEX(Objednavka!A:I,701,4)","v":0},null,{"$f":"INDEX(Objednavka!A:I,701,5)","v":0},{"$f":"INDEX(Objednavka!A:I,701,7)","v":0},{"$f":"INDEX(Objednavka!A:I,701,8)","v":0},null,{"$f":"IF(INDEX(Objednavka!A:J,701,10)=\"\",\"\",INDEX(Objednavka!A:J,701,10))","v":""}]
[null,{"$f":"IF(INDEX(Objednavka!A:I,702,3)=\"\",INDEX(Objednavka!A:I,702,1),INDEX(Objednavka!A:I,702,3))","v":0},null,null,null,null,null,{"$f":"INDEX(Objednavka!A:I,702,4)","v":0},null,{"$f":"INDEX(Objednavka!A:I,702,5)","v":0},{"$f":"INDEX(Objednavka!A:I,702,7)","v":0},{"$f":"INDEX(Objednavka!A:I,702,8)","v":0},null,{"$f":"IF(INDEX(Objednavka!A:J,702,10)=\"\",\"\",INDEX(Objednavka!A:J,702,10))","v":""}]
[null,{"$f":"IF(INDEX(Objednavka!A:I,703,3)=\"\",INDEX(Objednavka!A:I,703,1),INDEX(Objednavka!A:I,703,3))","v":0},null,null,null,null,null,{"$f":"INDEX(Objednavka!A:I,703,4)","v":0},null,{"$f":"INDEX(Objednavka!A:I,703,5)","v":0},{"$f":"INDEX(Objednavka!A:I,703,7)","v":0},{"$f":"INDEX(Objednavka!A:I,703,8)","v":0},null,{"$f":"IF(INDEX(Objednavka!A:J,703,10)=\"\",\"\",INDEX(Objednavka!A:J,703,10))","v":""}]
[null,{"$f":"IF(INDEX(Objednavka!A:I,704,3)=\"\",INDEX(Objednavka!A:I,704,1),INDEX(Objednavka!A:I,704,3))","v":0},null,null,null,null,null,{"$f":"INDEX(Objednavka!A:I,704,4)","v":0},null,{"$f":"INDEX(Objednavka!A:I,704,5)","v":0},{"$f":"INDEX(Objednavka!A:I,704,7)","v":0},{"$f":"INDEX(Objednavka!A:I,704,8)","v":0},null,{"$f":"IF(INDEX(Objednavka!A:J,704,10)=\"\",\"\",INDEX(Objednavka!A:J,704,10))","v":""}]
[null,{"$f":"IF(INDEX(Objednavka!A:I,705,3)=\"\",INDEX(Objednavka!A:I,705,1),INDEX(Objednavka!A:I,705,3))","v":0},null,null,null,null,null,{"$f":"INDEX(Objednavka!A:I,705,4)","v":0},null,{"$f":"INDEX(Objednavka!A:I,705,5)","v":0},{"$f":"INDEX(Objednavka!A:I,705,7)","v":0},{"$f":"INDEX(Objednavka!A:I,705,8)","v":0},null,{"$f":"IF(INDEX(Objednavka!A:J,705,10)=\"\",\"\",INDEX(Objednavka!A:J,705,10))","v":""}]
[null,{"$f":"IF(INDEX(Objednavka!A:I,706,3)=\"\",INDEX(Objednavka!A:I,706,1),INDEX(Objednavka!A:I,706,3))","v":0},null,null,null,null,null,{"$f":"INDEX(Objednavka!A:I,706,4)","v":0},null,{"$f":"INDEX(Objednavka!A:I,706,5)","v":0},{"$f":"INDEX(Objednavka!A:I,706,7)","v":0},{"$f":"INDEX(Objednavka!A:I,706,8)","v":0},null,{"$f":"IF(INDEX(Objednavka!A:J,706,10)=\"\",\"\",INDEX(Objednavka!A:J,706,10))","v":""}]
[null,{"$f":"IF(INDEX(Objednavka!A:I,707,3)=\"\",INDEX(Objednavka!A:I,707,1),INDEX(Objednavka!A:I,707,3))","v":0},null,null,null,null,null,{"$f":"INDEX(Objednavka!A:I,707,4)","v":0},null,{"$f":"INDEX(Objednavka!A:I,707,5)","v":0},{"$f":"INDEX(Objednavka!A:I,707,7)","v":0},{"$f":"INDEX(Objednavka!A:I,707,8)","v":0},null,{"$f":"IF(INDEX(Objednavka!A:J,707,10)=\"\",\"\",INDEX(Objednavka!A:J,707,10))","v":""}]
[null,{"$f":"IF(INDEX(Objednavka!A:I,708,3)=\"\",INDEX(Objednavka!A:I,708,1),INDEX(Objednavka!A:I,708,3))","v":0},null,null,null,null,null,{"$f":"INDEX(Objednavka!A:I,708,4)","v":0},null,{"$f":"INDEX(Objednavka!A:I,708,5)","v":0},{"$f":"INDEX(Objednavka!A:I,708,7)","v":0},{"$f":"INDEX(Objednavka!A:I,708,8)","v":0},null,{"$f":"IF(INDEX(Objednavka!A:J,708,10)=\"\",\"\",INDEX(Objednavka!A:J,708,10))","v":""}]
[null,{"$f":"IF(INDEX(Objednavka!A:I,709,3)=\"\",INDEX(Objednavka!A:I,709,1),INDEX(Objednavka!A:I,709,3))","v":0},null,null,null,null,null,{"$f":"INDEX(Objednavka!A:I,709,4)","v":0},null,{"$f":"INDEX(Objednavka!A:I,709,5)","v":0},{"$f":"INDEX(Objednavka!A:I,709,7)","v":0},{"$f":"INDEX(Objednavka!A:I,709,8)","v":0},null,{"$f":"IF(INDEX(Objednavka!A:J,709,10)=\"\",\"\",INDEX(Objednavka!A:J,709,10))","v":""}]
[null,{"$f":"IF(INDEX(Objednavka!A:I,710,3)=\"\",INDEX(Objednavka!A:I,710,1),INDEX(Objednavka!A:I,710,3))","v":0},null,null,null,null,null,{"$f":"INDEX(Objednavka!A:I,710,4)","v":0},null,{"$f":"INDEX(Objednavka!A:I,710,5)","v":0},{"$f":"INDEX(Objednavka!A:I,710,7)","v":0},{"$f":"INDEX(Objednavka!A:I,710,8)","v":0},null,{"$f":"IF(INDEX(Objednavka!A:J,710,10)=\"\",\"\",INDEX(Objednavka!A:J,710,10))","v":""}]
[null,{"$f":"IF(INDEX(Objednavka!A:I,711,3)=\"\",INDEX(Objednavka!A:I,711,1),INDEX(Objednavka!A:I,711,3))","v":0},null,null,null,null,null,{"$f":"INDEX(Objednavka!A:I,711,4)","v":0},null,{"$f":"INDEX(Objednavka!A:I,711,5)","v":0},{"$f":"INDEX(Objednavka!A:I,711,7)","v":0},{"$f":"INDEX(Objednavka!A:I,711,8)","v":0},null,{"$f":"IF(INDEX(Objednavka!A:J,711,10)=\"\",\"\",INDEX(Objednavka!A:J,711,10))","v":""}]
[null,{"$f":"IF(INDEX(Objednavka!A:I,712,3)=\"\",INDEX(Objednavka!A:I,712,1),INDEX(Objednavka!A:I,712,3))","v":0},null,null,null,null,null,{"$f":"INDEX(Objednavka!A:I,712,4)","v":0},null,{"$f":"INDEX(Objednavka!A:I,712,5)","v":0},{"$f":"INDEX(Objednavka!A:I,712,7)","v":0},{"$f":"INDEX(Objednavka!A:I,712,8)","v":0},null,{"$f":"IF(INDEX(Objednavka!A:J,712,10)=\"\",\"\",INDEX(Objednavka!A:J,712,10))","v":""}]
[null,{"$f":"IF(INDEX(Objednavka!A:I,713,3)=\"\",INDEX(Objednavka!A:I,713,1),INDEX(Objednavka!A:I,713,3))","v":0},null,null,null,null,null,{"$f":"INDEX(Objednavka!A:I,713,4)","v":0},null,{"$f":"INDEX(Objednavka!A:I,713,5)","v":0},{"$f":"INDEX(Objednavka!A:I,713,7)","v":0},{"$f":"INDEX(Objednavka!A:I,713,8)","v":0},null,{"$f":"IF(INDEX(Objednavka!A:J,713,10)=\"\",\"\",INDEX(Objednavka!A:J,713,10))","v":""}]
[null,{"$f":"IF(INDEX(Objednavka!A:I,714,3)=\"\",INDEX(Objednavka!A:I,714,1),INDEX(Objednavka!A:I,714,3))","v":0},null,null,null,null,null,{"$f":"INDEX(Objednavka!A:I,714,4)","v":0},null,{"$f":"INDEX(Objednavka!A:I,714,5)","v":0},{"$f":"INDEX(Objednavka!A:I,714,7)","v":0},{"$f":"INDEX(Objednavka!A:I,714,8)","v":0},null,{"$f":"IF(INDEX(Objednavka!A:J,714,10)=\"\",\"\",INDEX(Objednavka!A:J,714,10))","v":""}]
[null,{"$f":"IF(INDEX(Objednavka!A:I,715,3)=\"\",INDEX(Objednavka!A:I,715,1),INDEX(Objednavka!A:I,715,3))","v":0},null,null,null,null,null,{"$f":"INDEX(Objednavka!A:I,715,4)","v":0},null,{"$f":"INDEX(Objednavka!A:I,715,5)","v":0},{"$f":"INDEX(Objednavka!A:I,715,7)","v":0},{"$f":"INDEX(Objednavka!A:I,715,8)","v":0},null,{"$f":"IF(INDEX(Objednavka!A:J,715,10)=\"\",\"\",INDEX(Objednavka!A:J,715,10))","v":""}]
[null,{"$f":"IF(INDEX(Objednavka!A:I,716,3)=\"\",INDEX(Objednavka!A:I,716,1),INDEX(Objednavka!A:I,716,3))","v":0},null,null,null,null,null,{"$f":"INDEX(Objednavka!A:I,716,4)","v":0},null,{"$f":"INDEX(Objednavka!A:I,716,5)","v":0},{"$f":"INDEX(Objednavka!A:I,716,7)","v":0},{"$f":"INDEX(Objednavka!A:I,716,8)","v":0},null,{"$f":"IF(INDEX(Objednavka!A:J,716,10)=\"\",\"\",INDEX(Objednavka!A:J,716,10))","v":""}]
[null,{"$f":"IF(INDEX(Objednavka!A:I,717,3)=\"\",INDEX(Objednavka!A:I,717,1),INDEX(Objednavka!A:I,717,3))","v":0},null,null,null,null,null,{"$f":"INDEX(Objednavka!A:I,717,4)","v":0},null,{"$f":"INDEX(Objednavka!A:I,717,5)","v":0},{"$f":"INDEX(Objednavka!A:I,717,7)","v":0},{"$f":"INDEX(Objednavka!A:I,717,8)","v":0},null,{"$f":"IF(INDEX(Objednavka!A:J,717,10)=\"\",\"\",INDEX(Objednavka!A:J,717,10))","v":""}]
[null,{"$f":"IF(INDEX(Objednavka!A:I,718,3)=\"\",INDEX(Objednavka!A:I,718,1),INDEX(Objednavka!A:I,718,3))","v":0},null,null,null,null,null,{"$f":"INDEX(Objednavka!A:I,718,4)","v":0},null,{"$f":"INDEX(Objednavka!A:I,718,5)","v":0},{"$f":"INDEX(Objednavka!A:I,718,7)","v":0},{"$f":"INDEX(Objednavka!A:I,718,8)","v":0},null,{"$f":"IF(INDEX(Objednavka!A:J,718,10)=\"\",\"\",INDEX(Objednavka!A:J,718,10))","v":""}]
[null,{"$f":"IF(INDEX(Objednavka!A:I,719,3)=\"\",INDEX(Objednavka!A:I,719,1),INDEX(Objednavka!A:I,719,3))","v":0},null,null,null,null,null,{"$f":"INDEX(Objednavka!A:I,719,4)","v":0},null,{"$f":"INDEX(Objednavka!A:I,719,5)","v":0},{"$f":"INDEX(Objednavka!A:I,719,7)","v":0},{"$f":"INDEX(Objednavka!A:I,719,8)","v":0},null,{"$f":"IF(INDEX(Objednavka!A:J,719,10)=\"\",\"\",INDEX(Objednavka!A:J,719,10))","v":""}]
[null,{"$f":"IF(INDEX(Objednavka!A:I,720,3)=\"\",INDEX(Objednavka!A:I,720,1),INDEX(Objednavka!A:I,720,3))","v":0},null,null,null,null,null,{"$f":"INDEX(Objednavka!A:I,720,4)","v":0},null,{"$f":"INDEX(Objednavka!A:I,720,5)","v":0},{"$f":"INDEX(Objednavka!A:I,720,7)","v":0},{"$f":"INDEX(Objednavka!A:I,720,8)","v":0},null,{"$f":"IF(INDEX(Objednavka!A:J,720,10)=\"\",\"\",INDEX(Objednavka!A:J,720,10))","v":""}]
[null,{"$f":"IF(INDEX(Objednavka!A:I,721,3)=\"\",INDEX(Objednavka!A:I,721,1),INDEX(Objednavka!A:I,721,3))","v":0},null,null,null,null,null,{"$f":"INDEX(Objednavka!A:I,721,4)","v":0},null,{"$f":"INDEX(Objednavka!A:I,721,5)","v":0},{"$f":"INDEX(Objednavka!A:I,721,7)","v":0},{"$f":"INDEX(Objednavka!A:I,721,8)","v":0},null,{"$f":"IF(INDEX(Objednavka!A:J,721,10)=\"\",\"\",INDEX(Objednavka!A:J,721,10))","v":""}]
[null,{"$f":"IF(INDEX(Objednavka!A:I,722,3)=\"\",INDEX(Objednavka!A:I,722,1),INDEX(Objednavka!A:I,722,3))","v":0},null,null,null,null,null,{"$f":"INDEX(Objednavka!A:I,722,4)","v":0},null,{"$f":"INDEX(Objednavka!A:I,722,5)","v":0},{"$f":"INDEX(Objednavka!A:I,722,7)","v":0},{"$f":"INDEX(Objednavka!A:I,722,8)","v":0},null,{"$f":"IF(INDEX(Objednavka!A:J,722,10)=\"\",\"\",INDEX(Objednavka!A:J,722,10))","v":""}]
[null,{"$f":"IF(INDEX(Objednavka!A:I,723,3)=\"\",INDEX(Objednavka!A:I,723,1),INDEX(Objednavka!A:I,723,3))","v":0},null,null,null,null,null,{"$f":"INDEX(Objednavka!A:I,723,4)","v":0},null,{"$f":"INDEX(Objednavka!A:I,723,5)","v":0},{"$f":"INDEX(Objednavka!A:I,723,7)","v":0},{"$f":"INDEX(Objednavka!A:I,723,8)","v":0},null,{"$f":"IF(INDEX(Objednavka!A:J,723,10)=\"\",\"\",INDEX(Objednavka!A:J,723,10))","v":""}]
[null,{"$f":"IF(INDEX(Objednavka!A:I,724,3)=\"\",INDEX(Objednavka!A:I,724,1),INDEX(Objednavka!A:I,724,3))","v":0},null,null,null,null,null,{"$f":"INDEX(Objednavka!A:I,724,4)","v":0},null,{"$f":"INDEX(Objednavka!A:I,724,5)","v":0},{"$f":"INDEX(Objednavka!A:I,724,7)","v":0},{"$f":"INDEX(Objednavka!A:I,724,8)","v":0},null,{"$f":"IF(INDEX(Objednavka!A:J,724,10)=\"\",\"\",INDEX(Objednavka!A:J,724,10))","v":""}]
[null,{"$f":"IF(INDEX(Objednavka!A:I,725,3)=\"\",INDEX(Objednavka!A:I,725,1),INDEX(Objednavka!A:I,725,3))","v":0},null,null,null,null,null,{"$f":"INDEX(Objednavka!A:I,725,4)","v":0},null,{"$f":"INDEX(Objednavka!A:I,725,5)","v":0},{"$f":"INDEX(Objednavka!A:I,725,7)","v":0},{"$f":"INDEX(Objednavka!A:I,725,8)","v":0},null,{"$f":"IF(INDEX(Objednavka!A:J,725,10)=\"\",\"\",INDEX(Objednavka!A:J,725,10))","v":""}]
[null,{"$f":"IF(INDEX(Objednavka!A:I,726,3)=\"\",INDEX(Objednavka!A:I,726,1),INDEX(Objednavka!A:I,726,3))","v":0},null,null,null,null,null,{"$f":"INDEX(Objednavka!A:I,726,4)","v":0},null,{"$f":"INDEX(Objednavka!A:I,726,5)","v":0},{"$f":"INDEX(Objednavka!A:I,726,7)","v":0},{"$f":"INDEX(Objednavka!A:I,726,8)","v":0},null,{"$f":"IF(INDEX(Objednavka!A:J,726,10)=\"\",\"\",INDEX(Objednavka!A:J,726,10))","v":""}]
[null,{"$f":"IF(INDEX(Objednavka!A:I,727,3)=\"\",INDEX(Objednavka!A:I,727,1),INDEX(Objednavka!A:I,727,3))","v":0},null,null,null,null,null,{"$f":"INDEX(Objednavka!A:I,727,4)","v":0},null,{"$f":"INDEX(Objednavka!A:I,727,5)","v":0},{"$f":"INDEX(Objednavka!A:I,727,7)","v":0},{"$f":"INDEX(Objednavka!A:I,727,8)","v":0},null,{"$f":"IF(INDEX(Objednavka!A:J,727,10)=\"\",\"\",INDEX(Objednavka!A:J,727,10))","v":""}]
[null,{"$f":"IF(INDEX(Objednavka!A:I,728,3)=\"\",INDEX(Objednavka!A:I,728,1),INDEX(Objednavka!A:I,728,3))","v":0},null,null,null,null,null,{"$f":"INDEX(Objednavka!A:I,728,4)","v":0},null,{"$f":"INDEX(Objednavka!A:I,728,5)","v":0},{"$f":"INDEX(Objednavka!A:I,728,7)","v":0},{"$f":"INDEX(Objednavka!A:I,728,8)","v":0},null,{"$f":"IF(INDEX(Objednavka!A:J,728,10)=\"\",\"\",INDEX(Objednavka!A:J,728,10))","v":""}]
[null,{"$f":"IF(INDEX(Objednavka!A:I,729,3)=\"\",INDEX(Objednavka!A:I,729,1),INDEX(Objednavka!A:I,729,3))","v":0},null,null,null,null,null,{"$f":"INDEX(Objednavka!A:I,729,4)","v":0},null,{"$f":"INDEX(Objednavka!A:I,729,5)","v":0},{"$f":"INDEX(Objednavka!A:I,729,7)","v":0},{"$f":"INDEX(Objednavka!A:I,729,8)","v":0},null,{"$f":"IF(INDEX(Objednavka!A:J,729,10)=\"\",\"\",INDEX(Objednavka!A:J,729,10))","v":""}]
[null,{"$f":"IF(INDEX(Objednavka!A:I,730,3)=\"\",INDEX(Objednavka!A:I,730,1),INDEX(Objednavka!A:I,730,3))","v":0},null,null,null,null,null,{"$f":"INDEX(Objednavka!A:I,730,4)","v":0},null,{"$f":"INDEX(Objednavka!A:I,730,5)","v":0},{"$f":"INDEX(Objednavka!A:I,730,7)","v":0},{"$f":"INDEX(Objednavka!A:I,730,8)","v":0},null,{"$f":"IF(INDEX(Objednavka!A:J,730,10)=\"\",\"\",INDEX(Objednavka!A:J,730,10))","v":""}]
[null,{"$f":"IF(INDEX(Objednavka!A:I,731,3)=\"\",INDEX(Objednavka!A:I,731,1),INDEX(Objednavka!A:I,731,3))","v":0},null,null,null,null,null,{"$f":"INDEX(Objednavka!A:I,731,4)","v":0},null,{"$f":"INDEX(Objednavka!A:I,731,5)","v":0},{"$f":"INDEX(Objednavka!A:I,731,7)","v":0},{"$f":"INDEX(Objednavka!A:I,731,8)","v":0},null,{"$f":"IF(INDEX(Objednavka!A:J,731,10)=\"\",\"\",INDEX(Objednavka!A:J,731,10))","v":""}]
[null,{"$f":"IF(INDEX(Objednavka!A:I,732,3)=\"\",INDEX(Objednavka!A:I,732,1),INDEX(Objednavka!A:I,732,3))","v":0},null,null,null,null,null,{"$f":"INDEX(Objednavka!A:I,732,4)","v":0},null,{"$f":"INDEX(Objednavka!A:I,732,5)","v":0},{"$f":"INDEX(Objednavka!A:I,732,7)","v":0},{"$f":"INDEX(Objednavka!A:I,732,8)","v":0},null,{"$f":"IF(INDEX(Objednavka!A:J,732,10)=\"\",\"\",INDEX(Objednavka!A:J,732,10))","v":""}]
[null,{"$f":"IF(INDEX(Objednavka!A:I,733,3)=\"\",INDEX(Objednavka!A:I,733,1),INDEX(Objednavka!A:I,733,3))","v":0},null,null,null,null,null,{"$f":"INDEX(Objednavka!A:I,733,4)","v":0},null,{"$f":"INDEX(Objednavka!A:I,733,5)","v":0},{"$f":"INDEX(Objednavka!A:I,733,7)","v":0},{"$f":"INDEX(Objednavka!A:I,733,8)","v":0},null,{"$f":"IF(INDEX(Objednavka!A:J,733,10)=\"\",\"\",INDEX(Objednavka!A:J,733,10))","v":""}]
[null,{"$f":"IF(INDEX(Objednavka!A:I,734,3)=\"\",INDEX(Objednavka!A:I,734,1),INDEX(Objednavka!A:I,734,3))","v":0},null,null,null,null,null,{"$f":"INDEX(Objednavka!A:I,734,4)","v":0},null,{"$f":"INDEX(Objednavka!A:I,734,5)","v":0},{"$f":"INDEX(Objednavka!A:I,734,7)","v":0},{"$f":"INDEX(Objednavka!A:I,734,8)","v":0},null,{"$f":"IF(INDEX(Objednavka!A:J,734,10)=\"\",\"\",INDEX(Objednavka!A:J,734,10))","v":""}]
[null,{"$f":"IF(INDEX(Objednavka!A:I,735,3)=\"\",INDEX(Objednavka!A:I,735,1),INDEX(Objednavka!A:I,735,3))","v":0},null,null,null,null,null,{"$f":"INDEX(Objednavka!A:I,735,4)","v":0},null,{"$f":"INDEX(Objednavka!A:I,735,5)","v":0},{"$f":"INDEX(Objednavka!A:I,735,7)","v":0},{"$f":"INDEX(Objednavka!A:I,735,8)","v":0},null,{"$f":"IF(INDEX(Objednavka!A:J,735,10)=\"\",\"\",INDEX(Objednavka!A:J,735,10))","v":""}]
[null,{"$f":"IF(INDEX(Objednavka!A:I,736,3)=\"\",INDEX(Objednavka!A:I,736,1),INDEX(Objednavka!A:I,736,3))","v":0},null,null,null,null,null,{"$f":"INDEX(Objednavka!A:I,736,4)","v":0},null,{"$f":"INDEX(Objednavka!A:I,736,5)","v":0},{"$f":"INDEX(Objednavka!A:I,736,7)","v":0},{"$f":"INDEX(Objednavka!A:I,736,8)","v":0},null,{"$f":"IF(INDEX(Objednavka!A:J,736,10)=\"\",\"\",INDEX(Objednavka!A:J,736,10))","v":""}]
[null,{"$f":"IF(INDEX(Objednavka!A:I,737,3)=\"\",INDEX(Objednavka!A:I,737,1),INDEX(Objednavka!A:I,737,3))","v":0},null,null,null,null,null,{"$f":"INDEX(Objednavka!A:I,737,4)","v":0},null,{"$f":"INDEX(Objednavka!A:I,737,5)","v":0},{"$f":"INDEX(Objednavka!A:I,737,7)","v":0},{"$f":"INDEX(Objednavka!A:I,737,8)","v":0},null,{"$f":"IF(INDEX(Objednavka!A:J,737,10)=\"\",\"\",INDEX(Objednavka!A:J,737,10))","v":""}]
[null,{"$f":"IF(INDEX(Objednavka!A:I,738,3)=\"\",INDEX(Objednavka!A:I,738,1),INDEX(Objednavka!A:I,738,3))","v":0},null,null,null,null,null,{"$f":"INDEX(Objednavka!A:I,738,4)","v":0},null,{"$f":"INDEX(Objednavka!A:I,738,5)","v":0},{"$f":"INDEX(Objednavka!A:I,738,7)","v":0},{"$f":"INDEX(Objednavka!A:I,738,8)","v":0},null,{"$f":"IF(INDEX(Objednavka!A:J,738,10)=\"\",\"\",INDEX(Objednavka!A:J,738,10))","v":""}]
[null,{"$f":"IF(INDEX(Objednavka!A:I,739,3)=\"\",INDEX(Objednavka!A:I,739,1),INDEX(Objednavka!A:I,739,3))","v":0},null,null,null,null,null,{"$f":"INDEX(Objednavka!A:I,739,4)","v":0},null,{"$f":"INDEX(Objednavka!A:I,739,5)","v":0},{"$f":"INDEX(Objednavka!A:I,739,7)","v":0},{"$f":"INDEX(Objednavka!A:I,739,8)","v":0},null,{"$f":"IF(INDEX(Objednavka!A:J,739,10)=\"\",\"\",INDEX(Objednavka!A:J,739,10))","v":""}]
[null,{"$f":"IF(INDEX(Objednavka!A:I,740,3)=\"\",INDEX(Objednavka!A:I,740,1),INDEX(Objednavka!A:I,740,3))","v":0},null,null,null,null,null,{"$f":"INDEX(Objednavka!A:I,740,4)","v":0},null,{"$f":"INDEX(Objednavka!A:I,740,5)","v":0},{"$f":"INDEX(Objednavka!A:I,740,7)","v":0},{"$f":"INDEX(Objednavka!A:I,740,8)","v":0},null,{"$f":"IF(INDEX(Objednavka!A:J,740,10)=\"\",\"\",INDEX(Objednavka!A:J,740,10))","v":""}]
[null,{"$f":"IF(INDEX(Objednavka!A:I,741,3)=\"\",INDEX(Objednavka!A:I,741,1),INDEX(Objednavka!A:I,741,3))","v":0},null,null,null,null,null,{"$f":"INDEX(Objednavka!A:I,741,4)","v":0},null,{"$f":"INDEX(Objednavka!A:I,741,5)","v":0},{"$f":"INDEX(Objednavka!A:I,741,7)","v":0},{"$f":"INDEX(Objednavka!A:I,741,8)","v":0},null,{"$f":"IF(INDEX(Objednavka!A:J,741,10)=\"\",\"\",INDEX(Objednavka!A:J,741,10))","v":""}]
[null,{"$f":"IF(INDEX(Objednavka!A:I,742,3)=\"\",INDEX(Objednavka!A:I,742,1),INDEX(Objednavka!A:I,742,3))","v":0},null,null,null,null,null,{"$f":"INDEX(Objednavka!A:I,742,4)","v":0},null,{"$f":"INDEX(Objednavka!A:I,742,5)","v":0},{"$f":"INDEX(Objednavka!A:I,742,7)","v":0},{"$f":"INDEX(Objednavka!A:I,742,8)","v":0},null,{"$f":"IF(INDEX(Objednavka!A:J,742,10)=\"\",\"\",INDEX(Objednavka!A:J,742,10))","v":""}]
[null,{"$f":"IF(INDEX(Objednavka!A:I,743,3)=\"\",INDEX(Objednavka!A:I,743,1),INDEX(Objednavka!A:I,743,3))","v":0},null,null,null,null,null,{"$f":"INDEX(Objednavka!A:I,743,4)","v":0},null,{"$f":"INDEX(Objednavka!A:I,743,5)","v":0},{"$f":"INDEX(Objednavka!A:I,743,7)","v":0},{"$f":"INDEX(Objednavka!A:I,743,8)","v":0},null,{"$f":"IF(INDEX(Objednavka!A:J,743,10)=\"\",\"\",INDEX(Objednavka!A:J,743,10))","v":""}]
[null,{"$f":"IF(INDEX(Objednavka!A:I,744,3)=\"\",INDEX(Objednavka!A:I,744,1),INDEX(Objednavka!A:I,744,3))","v":0},null,null,null,null,null,{"$f":"INDEX(Objednavka!A:I,744,4)","v":0},null,{"$f":"INDEX(Objednavka!A:I,744,5)","v":0},{"$f":"INDEX(Objednavka!A:I,744,7)","v":0},{"$f":"INDEX(Objednavka!A:I,744,8)","v":0},null,{"$f":"IF(INDEX(Objednavka!A:J,744,10)=\"\",\"\",INDEX(Objednavka!A:J,744,10))","v":""}]
[null,{"$f":"IF(INDEX(Objednavka!A:I,745,3)=\"\",INDEX(Objednavka!A:I,745,1),INDEX(Objednavka!A:I,745,3))","v":0},null,null,null,null,null,{"$f":"INDEX(Objednavka!A:I,745,4)","v":0},null,{"$f":"INDEX(Objednavka!A:I,745,5)","v":0},{"$f":"INDEX(Objednavka!A:I,745,7)","v":0},{"$f":"INDEX(Objednavka!A:I,745,8)","v":0},null,{"$f":"IF(INDEX(Objednavka!A:J,745,10)=\"\",\"\",INDEX(Objednavka!A:J,745,10))","v":""}]
[null,{"$f":"IF(INDEX(Objednavka!A:I,746,3)=\"\",INDEX(Objednavka!A:I,746,1),INDEX(Objednavka!A:I,746,3))","v":0},null,null,null,null,null,{"$f":"INDEX(Objednavka!A:I,746,4)","v":0},null,{"$f":"INDEX(Objednavka!A:I,746,5)","v":0},{"$f":"INDEX(Objednavka!A:I,746,7)","v":0},{"$f":"INDEX(Objednavka!A:I,746,8)","v":0},null,{"$f":"IF(INDEX(Objednavka!A:J,746,10)=\"\",\"\",INDEX(Objednavka!A:J,746,10))","v":""}]
[null,{"$f":"IF(INDEX(Objednavka!A:I,747,3)=\"\",INDEX(Objednavka!A:I,747,1),INDEX(Objednavka!A:I,747,3))","v":0},null,null,null,null,null,{"$f":"INDEX(Objednavka!A:I,747,4)","v":0},null,{"$f":"INDEX(Objednavka!A:I,747,5)","v":0},{"$f":"INDEX(Objednavka!A:I,747,7)","v":0},{"$f":"INDEX(Objednavka!A:I,747,8)","v":0},null,{"$f":"IF(INDEX(Objednavka!A:J,747,10)=\"\",\"\",INDEX(Objednavka!A:J,747,10))","v":""}]
[null,{"$f":"IF(INDEX(Objednavka!A:I,748,3)=\"\",INDEX(Objednavka!A:I,748,1),INDEX(Objednavka!A:I,748,3))","v":0},null,null,null,null,null,{"$f":"INDEX(Objednavka!A:I,748,4)","v":0},null,{"$f":"INDEX(Objednavka!A:I,748,5)","v":0},{"$f":"INDEX(Objednavka!A:I,748,7)","v":0},{"$f":"INDEX(Objednavka!A:I,748,8)","v":0},null,{"$f":"IF(INDEX(Objednavka!A:J,748,10)=\"\",\"\",INDEX(Objednavka!A:J,748,10))","v":""}]
[null,{"$f":"IF(INDEX(Objednavka!A:I,749,3)=\"\",INDEX(Objednavka!A:I,749,1),INDEX(Objednavka!A:I,749,3))","v":0},null,null,null,null,null,{"$f":"INDEX(Objednavka!A:I,749,4)","v":0},null,{"$f":"INDEX(Objednavka!A:I,749,5)","v":0},{"$f":"INDEX(Objednavka!A:I,749,7)","v":0},{"$f":"INDEX(Objednavka!A:I,749,8)","v":0},null,{"$f":"IF(INDEX(Objednavka!A:J,749,10)=\"\",\"\",INDEX(Objednavka!A:J,749,10))","v":""}]
[null,{"$f":"IF(INDEX(Objednavka!A:I,750,3)=\"\",INDEX(Objednavka!A:I,750,1),INDEX(Objednavka!A:I,750,3))","v":0},null,null,null,null,null,{"$f":"INDEX(Objednavka!A:I,750,4)","v":0},null,{"$f":"INDEX(Objednavka!A:I,750,5)","v":0},{"$f":"INDEX(Objednavka!A:I,750,7)","v":0},{"$f":"INDEX(Objednavka!A:I,750,8)","v":0},null,{"$f":"IF(INDEX(Objednavka!A:J,750,10)=\"\",\"\",INDEX(Objednavka!A:J,750,10))","v":""}]
[null,{"$f":"IF(INDEX(Objednavka!A:I,751,3)=\"\",INDEX(Objednavka!A:I,751,1),INDEX(Objednavka!A:I,751,3))","v":0},null,null,null,null,null,{"$f":"INDEX(Objednavka!A:I,751,4)","v":0},null,{"$f":"INDEX(Objednavka!A:I,751,5)","v":0},{"$f":"INDEX(Objednavka!A:I,751,7)","v":0},{"$f":"INDEX(Objednavka!A:I,751,8)","v":0},null,{"$f":"IF(INDEX(Objednavka!A:J,751,10)=\"\",\"\",INDEX(Objednavka!A:J,751,10))","v":""}]
[null,{"$f":"IF(INDEX(Objednavka!A:I,752,3)=\"\",INDEX(Objednavka!A:I,752,1),INDEX(Objednavka!A:I,752,3))","v":0},null,null,null,null,null,{"$f":"INDEX(Objednavka!A:I,752,4)","v":0},null,{"$f":"INDEX(Objednavka!A:I,752,5)","v":0},{"$f":"INDEX(Objednavka!A:I,752,7)","v":0},{"$f":"INDEX(Objednavka!A:I,752,8)","v":0},null,{"$f":"IF(INDEX(Objednavka!A:J,752,10)=\"\",\"\",INDEX(Objednavka!A:J,752,10))","v":""}]
[null,{"$f":"IF(INDEX(Objednavka!A:I,753,3)=\"\",INDEX(Objednavka!A:I,753,1),INDEX(Objednavka!A:I,753,3))","v":0},null,null,null,null,null,{"$f":"INDEX(Objednavka!A:I,753,4)","v":0},null,{"$f":"INDEX(Objednavka!A:I,753,5)","v":0},{"$f":"INDEX(Objednavka!A:I,753,7)","v":0},{"$f":"INDEX(Objednavka!A:I,753,8)","v":0},null,{"$f":"IF(INDEX(Objednavka!A:J,753,10)=\"\",\"\",INDEX(Objednavka!A:J,753,10))","v":""}]
[null,{"$f":"IF(INDEX(Objednavka!A:I,754,3)=\"\",INDEX(Objednavka!A:I,754,1),INDEX(Objednavka!A:I,754,3))","v":0},null,null,null,null,null,{"$f":"INDEX(Objednavka!A:I,754,4)","v":0},null,{"$f":"INDEX(Objednavka!A:I,754,5)","v":0},{"$f":"INDEX(Objednavka!A:I,754,7)","v":0},{"$f":"INDEX(Objednavka!A:I,754,8)","v":0},null,{"$f":"IF(INDEX(Objednavka!A:J,754,10)=\"\",\"\",INDEX(Objednavka!A:J,754,10))","v":""}]
[null,{"$f":"IF(INDEX(Objednavka!A:I,755,3)=\"\",INDEX(Objednavka!A:I,755,1),INDEX(Objednavka!A:I,755,3))","v":0},null,null,null,null,null,{"$f":"INDEX(Objednavka!A:I,755,4)","v":0},null,{"$f":"INDEX(Objednavka!A:I,755,5)","v":0},{"$f":"INDEX(Objednavka!A:I,755,7)","v":0},{"$f":"INDEX(Objednavka!A:I,755,8)","v":0},null,{"$f":"IF(INDEX(Objednavka!A:J,755,10)=\"\",\"\",INDEX(Objednavka!A:J,755,10))","v":""}]
[null,{"$f":"IF(INDEX(Objednavka!A:I,756,3)=\"\",INDEX(Objednavka!A:I,756,1),INDEX(Objednavka!A:I,756,3))","v":0},null,null,null,null,null,{"$f":"INDEX(Objednavka!A:I,756,4)","v":0},null,{"$f":"INDEX(Objednavka!A:I,756,5)","v":0},{"$f":"INDEX(Objednavka!A:I,756,7)","v":0},{"$f":"INDEX(Objednavka!A:I,756,8)","v":0},null,{"$f":"IF(INDEX(Objednavka!A:J,756,10)=\"\",\"\",INDEX(Objednavka!A:J,756,10))","v":""}]
[null,{"$f":"IF(INDEX(Objednavka!A:I,757,3)=\"\",INDEX(Objednavka!A:I,757,1),INDEX(Objednavka!A:I,757,3))","v":0},null,null,null,null,null,{"$f":"INDEX(Objednavka!A:I,757,4)","v":0},null,{"$f":"INDEX(Objednavka!A:I,757,5)","v":0},{"$f":"INDEX(Objednavka!A:I,757,7)","v":0},{"$f":"INDEX(Objednavka!A:I,757,8)","v":0},null,{"$f":"IF(INDEX(Objednavka!A:J,757,10)=\"\",\"\",INDEX(Objednavka!A:J,757,10))","v":""}]
[null,{"$f":"IF(INDEX(Objednavka!A:I,758,3)=\"\",INDEX(Objednavka!A:I,758,1),INDEX(Objednavka!A:I,758,3))","v":0},null,null,null,null,null,{"$f":"INDEX(Objednavka!A:I,758,4)","v":0},null,{"$f":"INDEX(Objednavka!A:I,758,5)","v":0},{"$f":"INDEX(Objednavka!A:I,758,7)","v":0},{"$f":"INDEX(Objednavka!A:I,758,8)","v":0},null,{"$f":"IF(INDEX(Objednavka!A:J,758,10)=\"\",\"\",INDEX(Objednavka!A:J,758,10))","v":""}]
[null,{"$f":"IF(INDEX(Objednavka!A:I,759,3)=\"\",INDEX(Objednavka!A:I,759,1),INDEX(Objednavka!A:I,759,3))","v":0},null,null,null,null,null,{"$f":"INDEX(Objednavka!A:I,759,4)","v":0},null,{"$f":"INDEX(Objednavka!A:I,759,5)","v":0},{"$f":"INDEX(Objednavka!A:I,759,7)","v":0},{"$f":"INDEX(Objednavka!A:I,759,8)","v":0},null,{"$f":"IF(INDEX(Objednavka!A:J,759,10)=\"\",\"\",INDEX(Objednavka!A:J,759,10))","v":""}]
[null,{"$f":"IF(INDEX(Objednavka!A:I,760,3)=\"\",INDEX(Objednavka!A:I,760,1),INDEX(Objednavka!A:I,760,3))","v":0},null,null,null,null,null,{"$f":"INDEX(Objednavka!A:I,760,4)","v":0},null,{"$f":"INDEX(Objednavka!A:I,760,5)","v":0},{"$f":"INDEX(Objednavka!A:I,760,7)","v":0},{"$f":"INDEX(Objednavka!A:I,760,8)","v":0},null,{"$f":"IF(INDEX(Objednavka!A:J,760,10)=\"\",\"\",INDEX(Objednavka!A:J,760,10))","v":""}]
[null,{"$f":"IF(INDEX(Objednavka!A:I,761,3)=\"\",INDEX(Objednavka!A:I,761,1),INDEX(Objednavka!A:I,761,3))","v":0},null,null,null,null,null,{"$f":"INDEX(Objednavka!A:I,761,4)","v":0},null,{"$f":"INDEX(Objednavka!A:I,761,5)","v":0},{"$f":"INDEX(Objednavka!A:I,761,7)","v":0},{"$f":"INDEX(Objednavka!A:I,761,8)","v":0},null,{"$f":"IF(INDEX(Objednavka!A:J,761,10)=\"\",\"\",INDEX(Objednavka!A:J,761,10))","v":""}]
[null,{"$f":"IF(INDEX(Objednavka!A:I,762,3)=\"\",INDEX(Objednavka!A:I,762,1),INDEX(Objednavka!A:I,762,3))","v":0},null,null,null,null,null,{"$f":"INDEX(Objednavka!A:I,762,4)","v":0},null,{"$f":"INDEX(Objednavka!A:I,762,5)","v":0},{"$f":"INDEX(Objednavka!A:I,762,7)","v":0},{"$f":"INDEX(Objednavka!A:I,762,8)","v":0},null,{"$f":"IF(INDEX(Objednavka!A:J,762,10)=\"\",\"\",INDEX(Objednavka!A:J,762,10))","v":""}]
[null,{"$f":"IF(INDEX(Objednavka!A:I,763,3)=\"\",INDEX(Objednavka!A:I,763,1),INDEX(Objednavka!A:I,763,3))","v":0},null,null,null,null,null,{"$f":"INDEX(Objednavka!A:I,763,4)","v":0},null,{"$f":"INDEX(Objednavka!A:I,763,5)","v":0},{"$f":"INDEX(Objednavka!A:I,763,7)","v":0},{"$f":"INDEX(Objednavka!A:I,763,8)","v":0},null,{"$f":"IF(INDEX(Objednavka!A:J,763,10)=\"\",\"\",INDEX(Objednavka!A:J,763,10))","v":""}]
[null,{"$f":"IF(INDEX(Objednavka!A:I,764,3)=\"\",INDEX(Objednavka!A:I,764,1),INDEX(Objednavka!A:I,764,3))","v":0},null,null,null,null,null,{"$f":"INDEX(Objednavka!A:I,764,4)","v":0},null,{"$f":"INDEX(Objednavka!A:I,764,5)","v":0},{"$f":"INDEX(Objednavka!A:I,764,7)","v":0},{"$f":"INDEX(Objednavka!A:I,764,8)","v":0},null,{"$f":"IF(INDEX(Objednavka!A:J,764,10)=\"\",\"\",INDEX(Objednavka!A:J,764,10))","v":""}]
[null,{"$f":"IF(INDEX(Objednavka!A:I,765,3)=\"\",INDEX(Objednavka!A:I,765,1),INDEX(Objednavka!A:I,765,3))","v":0},null,null,null,null,null,{"$f":"INDEX(Objednavka!A:I,765,4)","v":0},null,{"$f":"INDEX(Objednavka!A:I,765,5)","v":0},{"$f":"INDEX(Objednavka!A:I,765,7)","v":0},{"$f":"INDEX(Objednavka!A:I,765,8)","v":0},null,{"$f":"IF(INDEX(Objednavka!A:J,765,10)=\"\",\"\",INDEX(Objednavka!A:J,765,10))","v":""}]
[null,{"$f":"IF(INDEX(Objednavka!A:I,766,3)=\"\",INDEX(Objednavka!A:I,766,1),INDEX(Objednavka!A:I,766,3))","v":0},null,null,null,null,null,{"$f":"INDEX(Objednavka!A:I,766,4)","v":0},null,{"$f":"INDEX(Objednavka!A:I,766,5)","v":0},{"$f":"INDEX(Objednavka!A:I,766,7)","v":0},{"$f":"INDEX(Objednavka!A:I,766,8)","v":0},null,{"$f":"IF(INDEX(Objednavka!A:J,766,10)=\"\",\"\",INDEX(Objednavka!A:J,766,10))","v":""}]
[null,{"$f":"IF(INDEX(Objednavka!A:I,767,3)=\"\",INDEX(Objednavka!A:I,767,1),INDEX(Objednavka!A:I,767,3))","v":0},null,null,null,null,null,{"$f":"INDEX(Objednavka!A:I,767,4)","v":0},null,{"$f":"INDEX(Objednavka!A:I,767,5)","v":0},{"$f":"INDEX(Objednavka!A:I,767,7)","v":0},{"$f":"INDEX(Objednavka!A:I,767,8)","v":0},null,{"$f":"IF(INDEX(Objednavka!A:J,767,10)=\"\",\"\",INDEX(Objednavka!A:J,767,10))","v":""}]
[null,{"$f":"IF(INDEX(Objednavka!A:I,768,3)=\"\",INDEX(Objednavka!A:I,768,1),INDEX(Objednavka!A:I,768,3))","v":0},null,null,null,null,null,{"$f":"INDEX(Objednavka!A:I,768,4)","v":0},null,{"$f":"INDEX(Objednavka!A:I,768,5)","v":0},{"$f":"INDEX(Objednavka!A:I,768,7)","v":0},{"$f":"INDEX(Objednavka!A:I,768,8)","v":0},null,{"$f":"IF(INDEX(Objednavka!A:J,768,10)=\"\",\"\",INDEX(Objednavka!A:J,768,10))","v":""}]
[null,{"$f":"IF(INDEX(Objednavka!A:I,769,3)=\"\",INDEX(Objednavka!A:I,769,1),INDEX(Objednavka!A:I,769,3))","v":0},null,null,null,null,null,{"$f":"INDEX(Objednavka!A:I,769,4)","v":0},null,{"$f":"INDEX(Objednavka!A:I,769,5)","v":0},{"$f":"INDEX(Objednavka!A:I,769,7)","v":0},{"$f":"INDEX(Objednavka!A:I,769,8)","v":0},null,{"$f":"IF(INDEX(Objednavka!A:J,769,10)=\"\",\"\",INDEX(Objednavka!A:J,769,10))","v":""}]
[null,{"$f":"IF(INDEX(Objednavka!A:I,770,3)=\"\",INDEX(Objednavka!A:I,770,1),INDEX(Objednavka!A:I,770,3))","v":0},null,null,null,null,null,{"$f":"INDEX(Objednavka!A:I,770,4)","v":0},null,{"$f":"INDEX(Objednavka!A:I,770,5)","v":0},{"$f":"INDEX(Objednavka!A:I,770,7)","v":0},{"$f":"INDEX(Objednavka!A:I,770,8)","v":0},null,{"$f":"IF(INDEX(Objednavka!A:J,770,10)=\"\",\"\",INDEX(Objednavka!A:J,770,10))","v":""}]
[null,{"$f":"IF(INDEX(Objednavka!A:I,771,3)=\"\",INDEX(Objednavka!A:I,771,1),INDEX(Objednavka!A:I,771,3))","v":0},null,null,null,null,null,{"$f":"INDEX(Objednavka!A:I,771,4)","v":0},null,{"$f":"INDEX(Objednavka!A:I,771,5)","v":0},{"$f":"INDEX(Objednavka!A:I,771,7)","v":0},{"$f":"INDEX(Objednavka!A:I,771,8)","v":0},null,{"$f":"IF(INDEX(Objednavka!A:J,771,10)=\"\",\"\",INDEX(Objednavka!A:J,771,10))","v":""}]
[null,{"$f":"IF(INDEX(Objednavka!A:I,772,3)=\"\",INDEX(Objednavka!A:I,772,1),INDEX(Objednavka!A:I,772,3))","v":0},null,null,null,null,null,{"$f":"INDEX(Objednavka!A:I,772,4)","v":0},null,{"$f":"INDEX(Objednavka!A:I,772,5)","v":0},{"$f":"INDEX(Objednavka!A:I,772,7)","v":0},{"$f":"INDEX(Objednavka!A:I,772,8)","v":0},null,{"$f":"IF(INDEX(Objednavka!A:J,772,10)=\"\",\"\",INDEX(Objednavka!A:J,772,10))","v":""}]
[null,{"$f":"IF(INDEX(Objednavka!A:I,773,3)=\"\",INDEX(Objednavka!A:I,773,1),INDEX(Objednavka!A:I,773,3))","v":0},null,null,null,null,null,{"$f":"INDEX(Objednavka!A:I,773,4)","v":0},null,{"$f":"INDEX(Objednavka!A:I,773,5)","v":0},{"$f":"INDEX(Objednavka!A:I,773,7)","v":0},{"$f":"INDEX(Objednavka!A:I,773,8)","v":0},null,{"$f":"IF(INDEX(Objednavka!A:J,773,10)=\"\",\"\",INDEX(Objednavka!A:J,773,10))","v":""}]
[null,{"$f":"IF(INDEX(Objednavka!A:I,774,3)=\"\",INDEX(Objednavka!A:I,774,1),INDEX(Objednavka!A:I,774,3))","v":0},null,null,null,null,null,{"$f":"INDEX(Objednavka!A:I,774,4)","v":0},null,{"$f":"INDEX(Objednavka!A:I,774,5)","v":0},{"$f":"INDEX(Objednavka!A:I,774,7)","v":0},{"$f":"INDEX(Objednavka!A:I,774,8)","v":0},null,{"$f":"IF(INDEX(Objednavka!A:J,774,10)=\"\",\"\",INDEX(Objednavka!A:J,774,10))","v":""}]
[null,{"$f":"IF(INDEX(Objednavka!A:I,775,3)=\"\",INDEX(Objednavka!A:I,775,1),INDEX(Objednavka!A:I,775,3))","v":0},null,null,null,null,null,{"$f":"INDEX(Objednavka!A:I,775,4)","v":0},null,{"$f":"INDEX(Objednavka!A:I,775,5)","v":0},{"$f":"INDEX(Objednavka!A:I,775,7)","v":0},{"$f":"INDEX(Objednavka!A:I,775,8)","v":0},null,{"$f":"IF(INDEX(Objednavka!A:J,775,10)=\"\",\"\",INDEX(Objednavka!A:J,775,10))","v":""}]
[null,{"$f":"IF(INDEX(Objednavka!A:I,776,3)=\"\",INDEX(Objednavka!A:I,776,1),INDEX(Objednavka!A:I,776,3))","v":0},null,null,null,null,null,{"$f":"INDEX(Objednavka!A:I,776,4)","v":0},null,{"$f":"INDEX(Objednavka!A:I,776,5)","v":0},{"$f":"INDEX(Objednavka!A:I,776,7)","v":0},{"$f":"INDEX(Objednavka!A:I,776,8)","v":0},null,{"$f":"IF(INDEX(Objednavka!A:J,776,10)=\"\",\"\",INDEX(Objednavka!A:J,776,10))","v":""}]
[null,{"$f":"IF(INDEX(Objednavka!A:I,777,3)=\"\",INDEX(Objednavka!A:I,777,1),INDEX(Objednavka!A:I,777,3))","v":0},null,null,null,null,null,{"$f":"INDEX(Objednavka!A:I,777,4)","v":0},null,{"$f":"INDEX(Objednavka!A:I,777,5)","v":0},{"$f":"INDEX(Objednavka!A:I,777,7)","v":0},{"$f":"INDEX(Objednavka!A:I,777,8)","v":0},null,{"$f":"IF(INDEX(Objednavka!A:J,777,10)=\"\",\"\",INDEX(Objednavka!A:J,777,10))","v":""}]
[null,{"$f":"IF(INDEX(Objednavka!A:I,778,3)=\"\",INDEX(Objednavka!A:I,778,1),INDEX(Objednavka!A:I,778,3))","v":0},null,null,null,null,null,{"$f":"INDEX(Objednavka!A:I,778,4)","v":0},null,{"$f":"INDEX(Objednavka!A:I,778,5)","v":0},{"$f":"INDEX(Objednavka!A:I,778,7)","v":0},{"$f":"INDEX(Objednavka!A:I,778,8)","v":0},null,{"$f":"IF(INDEX(Objednavka!A:J,778,10)=\"\",\"\",INDEX(Objednavka!A:J,778,10))","v":""}]
[null,{"$f":"IF(INDEX(Objednavka!A:I,779,3)=\"\",INDEX(Objednavka!A:I,779,1),INDEX(Objednavka!A:I,779,3))","v":0},null,null,null,null,null,{"$f":"INDEX(Objednavka!A:I,779,4)","v":0},null,{"$f":"INDEX(Objednavka!A:I,779,5)","v":0},{"$f":"INDEX(Objednavka!A:I,779,7)","v":0},{"$f":"INDEX(Objednavka!A:I,779,8)","v":0},null,{"$f":"IF(INDEX(Objednavka!A:J,779,10)=\"\",\"\",INDEX(Objednavka!A:J,779,10))","v":""}]
[null,{"$f":"IF(INDEX(Objednavka!A:I,780,3)=\"\",INDEX(Objednavka!A:I,780,1),INDEX(Objednavka!A:I,780,3))","v":0},null,null,null,null,null,{"$f":"INDEX(Objednavka!A:I,780,4)","v":0},null,{"$f":"INDEX(Objednavka!A:I,780,5)","v":0},{"$f":"INDEX(Objednavka!A:I,780,7)","v":0},{"$f":"INDEX(Objednavka!A:I,780,8)","v":0},null,{"$f":"IF(INDEX(Objednavka!A:J,780,10)=\"\",\"\",INDEX(Objednavka!A:J,780,10))","v":""}]
[null,{"$f":"IF(INDEX(Objednavka!A:I,781,3)=\"\",INDEX(Objednavka!A:I,781,1),INDEX(Objednavka!A:I,781,3))","v":0},null,null,null,null,null,{"$f":"INDEX(Objednavka!A:I,781,4)","v":0},null,{"$f":"INDEX(Objednavka!A:I,781,5)","v":0},{"$f":"INDEX(Objednavka!A:I,781,7)","v":0},{"$f":"INDEX(Objednavka!A:I,781,8)","v":0},null,{"$f":"IF(INDEX(Objednavka!A:J,781,10)=\"\",\"\",INDEX(Objednavka!A:J,781,10))","v":""}]
[null,{"$f":"IF(INDEX(Objednavka!A:I,782,3)=\"\",INDEX(Objednavka!A:I,782,1),INDEX(Objednavka!A:I,782,3))","v":0},null,null,null,null,null,{"$f":"INDEX(Objednavka!A:I,782,4)","v":0},null,{"$f":"INDEX(Objednavka!A:I,782,5)","v":0},{"$f":"INDEX(Objednavka!A:I,782,7)","v":0},{"$f":"INDEX(Objednavka!A:I,782,8)","v":0},null,{"$f":"IF(INDEX(Objednavka!A:J,782,10)=\"\",\"\",INDEX(Objednavka!A:J,782,10))","v":""}]
[null,{"$f":"IF(INDEX(Objednavka!A:I,783,3)=\"\",INDEX(Objednavka!A:I,783,1),INDEX(Objednavka!A:I,783,3))","v":0},null,null,null,null,null,{"$f":"INDEX(Objednavka!A:I,783,4)","v":0},null,{"$f":"INDEX(Objednavka!A:I,783,5)","v":0},{"$f":"INDEX(Objednavka!A:I,783,7)","v":0},{"$f":"INDEX(Objednavka!A:I,783,8)","v":0},null,{"$f":"IF(INDEX(Objednavka!A:J,783,10)=\"\",\"\",INDEX(Objednavka!A:J,783,10))","v":""}]
[null,{"$f":"IF(INDEX(Objednavka!A:I,784,3)=\"\",INDEX(Objednavka!A:I,784,1),INDEX(Objednavka!A:I,784,3))","v":0},null,null,null,null,null,{"$f":"INDEX(Objednavka!A:I,784,4)","v":0},null,{"$f":"INDEX(Objednavka!A:I,784,5)","v":0},{"$f":"INDEX(Objednavka!A:I,784,7)","v":0},{"$f":"INDEX(Objednavka!A:I,784,8)","v":0},null,{"$f":"IF(INDEX(Objednavka!A:J,784,10)=\"\",\"\",INDEX(Objednavka!A:J,784,10))","v":""}]
[null,{"$f":"IF(INDEX(Objednavka!A:I,785,3)=\"\",INDEX(Objednavka!A:I,785,1),INDEX(Objednavka!A:I,785,3))","v":0},null,null,null,null,null,{"$f":"INDEX(Objednavka!A:I,785,4)","v":0},null,{"$f":"INDEX(Objednavka!A:I,785,5)","v":0},{"$f":"INDEX(Objednavka!A:I,785,7)","v":0},{"$f":"INDEX(Objednavka!A:I,785,8)","v":0},null,{"$f":"IF(INDEX(Objednavka!A:J,785,10)=\"\",\"\",INDEX(Objednavka!A:J,785,10))","v":""}]
[null,{"$f":"IF(INDEX(Objednavka!A:I,786,3)=\"\",INDEX(Objednavka!A:I,786,1),INDEX(Objednavka!A:I,786,3))","v":0},null,null,null,null,null,{"$f":"INDEX(Objednavka!A:I,786,4)","v":0},null,{"$f":"INDEX(Objednavka!A:I,786,5)","v":0},{"$f":"INDEX(Objednavka!A:I,786,7)","v":0},{"$f":"INDEX(Objednavka!A:I,786,8)","v":0},null,{"$f":"IF(INDEX(Objednavka!A:J,786,10)=\"\",\"\",INDEX(Objednavka!A:J,786,10))","v":""}]
[null,{"$f":"IF(INDEX(Objednavka!A:I,787,3)=\"\",INDEX(Objednavka!A:I,787,1),INDEX(Objednavka!A:I,787,3))","v":0},null,null,null,null,null,{"$f":"INDEX(Objednavka!A:I,787,4)","v":0},null,{"$f":"INDEX(Objednavka!A:I,787,5)","v":0},{"$f":"INDEX(Objednavka!A:I,787,7)","v":0},{"$f":"INDEX(Objednavka!A:I,787,8)","v":0},null,{"$f":"IF(INDEX(Objednavka!A:J,787,10)=\"\",\"\",INDEX(Objednavka!A:J,787,10))","v":""}]
[null,{"$f":"IF(INDEX(Objednavka!A:I,788,3)=\"\",INDEX(Objednavka!A:I,788,1),INDEX(Objednavka!A:I,788,3))","v":0},null,null,null,null,null,{"$f":"INDEX(Objednavka!A:I,788,4)","v":0},null,{"$f":"INDEX(Objednavka!A:I,788,5)","v":0},{"$f":"INDEX(Objednavka!A:I,788,7)","v":0},{"$f":"INDEX(Objednavka!A:I,788,8)","v":0},null,{"$f":"IF(INDEX(Objednavka!A:J,788,10)=\"\",\"\",INDEX(Objednavka!A:J,788,10))","v":""}]
[null,{"$f":"IF(INDEX(Objednavka!A:I,789,3)=\"\",INDEX(Objednavka!A:I,789,1),INDEX(Objednavka!A:I,789,3))","v":0},null,null,null,null,null,{"$f":"INDEX(Objednavka!A:I,789,4)","v":0},null,{"$f":"INDEX(Objednavka!A:I,789,5)","v":0},{"$f":"INDEX(Objednavka!A:I,789,7)","v":0},{"$f":"INDEX(Objednavka!A:I,789,8)","v":0},null,{"$f":"IF(INDEX(Objednavka!A:J,789,10)=\"\",\"\",INDEX(Objednavka!A:J,789,10))","v":""}]
[null,{"$f":"IF(INDEX(Objednavka!A:I,790,3)=\"\",INDEX(Objednavka!A:I,790,1),INDEX(Objednavka!A:I,790,3))","v":0},null,null,null,null,null,{"$f":"INDEX(Objednavka!A:I,790,4)","v":0},null,{"$f":"INDEX(Objednavka!A:I,790,5)","v":0},{"$f":"INDEX(Objednavka!A:I,790,7)","v":0},{"$f":"INDEX(Objednavka!A:I,790,8)","v":0},null,{"$f":"IF(INDEX(Objednavka!A:J,790,10)=\"\",\"\",INDEX(Objednavka!A:J,790,10))","v":""}]
[null,{"$f":"IF(INDEX(Objednavka!A:I,791,3)=\"\",INDEX(Objednavka!A:I,791,1),INDEX(Objednavka!A:I,791,3))","v":0},null,null,null,null,null,{"$f":"INDEX(Objednavka!A:I,791,4)","v":0},null,{"$f":"INDEX(Objednavka!A:I,791,5)","v":0},{"$f":"INDEX(Objednavka!A:I,791,7)","v":0},{"$f":"INDEX(Objednavka!A:I,791,8)","v":0},null,{"$f":"IF(INDEX(Objednavka!A:J,791,10)=\"\",\"\",INDEX(Objednavka!A:J,791,10))","v":""}]
[null,{"$f":"IF(INDEX(Objednavka!A:I,792,3)=\"\",INDEX(Objednavka!A:I,792,1),INDEX(Objednavka!A:I,792,3))","v":0},null,null,null,null,null,{"$f":"INDEX(Objednavka!A:I,792,4)","v":0},null,{"$f":"INDEX(Objednavka!A:I,792,5)","v":0},{"$f":"INDEX(Objednavka!A:I,792,7)","v":0},{"$f":"INDEX(Objednavka!A:I,792,8)","v":0},null,{"$f":"IF(INDEX(Objednavka!A:J,792,10)=\"\",\"\",INDEX(Objednavka!A:J,792,10))","v":""}]
[null,{"$f":"IF(INDEX(Objednavka!A:I,793,3)=\"\",INDEX(Objednavka!A:I,793,1),INDEX(Objednavka!A:I,793,3))","v":0},null,null,null,null,null,{"$f":"INDEX(Objednavka!A:I,793,4)","v":0},null,{"$f":"INDEX(Objednavka!A:I,793,5)","v":0},{"$f":"INDEX(Objednavka!A:I,793,7)","v":0},{"$f":"INDEX(Objednavka!A:I,793,8)","v":0},null,{"$f":"IF(INDEX(Objednavka!A:J,793,10)=\"\",\"\",INDEX(Objednavka!A:J,793,10))","v":""}]
[null,{"$f":"IF(INDEX(Objednavka!A:I,794,3)=\"\",INDEX(Objednavka!A:I,794,1),INDEX(Objednavka!A:I,794,3))","v":0},null,null,null,null,null,{"$f":"INDEX(Objednavka!A:I,794,4)","v":0},null,{"$f":"INDEX(Objednavka!A:I,794,5)","v":0},{"$f":"INDEX(Objednavka!A:I,794,7)","v":0},{"$f":"INDEX(Objednavka!A:I,794,8)","v":0},null,{"$f":"IF(INDEX(Objednavka!A:J,794,10)=\"\",\"\",INDEX(Objednavka!A:J,794,10))","v":""}]
[null,{"$f":"IF(INDEX(Objednavka!A:I,795,3)=\"\",INDEX(Objednavka!A:I,795,1),INDEX(Objednavka!A:I,795,3))","v":0},null,null,null,null,null,{"$f":"INDEX(Objednavka!A:I,795,4)","v":0},null,{"$f":"INDEX(Objednavka!A:I,795,5)","v":0},{"$f":"INDEX(Objednavka!A:I,795,7)","v":0},{"$f":"INDEX(Objednavka!A:I,795,8)","v":0},null,{"$f":"IF(INDEX(Objednavka!A:J,795,10)=\"\",\"\",INDEX(Objednavka!A:J,795,10))","v":""}]
[null,{"$f":"IF(INDEX(Objednavka!A:I,796,3)=\"\",INDEX(Objednavka!A:I,796,1),INDEX(Objednavka!A:I,796,3))","v":0},null,null,null,null,null,{"$f":"INDEX(Objednavka!A:I,796,4)","v":0},null,{"$f":"INDEX(Objednavka!A:I,796,5)","v":0},{"$f":"INDEX(Objednavka!A:I,796,7)","v":0},{"$f":"INDEX(Objednavka!A:I,796,8)","v":0},null,{"$f":"IF(INDEX(Objednavka!A:J,796,10)=\"\",\"\",INDEX(Objednavka!A:J,796,10))","v":""}]
[null,{"$f":"IF(INDEX(Objednavka!A:I,797,3)=\"\",INDEX(Objednavka!A:I,797,1),INDEX(Objednavka!A:I,797,3))","v":0},null,null,null,null,null,{"$f":"INDEX(Objednavka!A:I,797,4)","v":0},null,{"$f":"INDEX(Objednavka!A:I,797,5)","v":0},{"$f":"INDEX(Objednavka!A:I,797,7)","v":0},{"$f":"INDEX(Objednavka!A:I,797,8)","v":0},null,{"$f":"IF(INDEX(Objednavka!A:J,797,10)=\"\",\"\",INDEX(Objednavka!A:J,797,10))","v":""}]
[null,{"$f":"IF(INDEX(Objednavka!A:I,798,3)=\"\",INDEX(Objednavka!A:I,798,1),INDEX(Objednavka!A:I,798,3))","v":0},null,null,null,null,null,{"$f":"INDEX(Objednavka!A:I,798,4)","v":0},null,{"$f":"INDEX(Objednavka!A:I,798,5)","v":0},{"$f":"INDEX(Objednavka!A:I,798,7)","v":0},{"$f":"INDEX(Objednavka!A:I,798,8)","v":0},null,{"$f":"IF(INDEX(Objednavka!A:J,798,10)=\"\",\"\",INDEX(Objednavka!A:J,798,10))","v":""}]
[null,{"$f":"IF(INDEX(Objednavka!A:I,799,3)=\"\",INDEX(Objednavka!A:I,799,1),INDEX(Objednavka!A:I,799,3))","v":0},null,null,null,null,null,{"$f":"INDEX(Objednavka!A:I,799,4)","v":0},null,{"$f":"INDEX(Objednavka!A:I,799,5)","v":0},{"$f":"INDEX(Objednavka!A:I,799,7)","v":0},{"$f":"INDEX(Objednavka!A:I,799,8)","v":0},null,{"$f":"IF(INDEX(Objednavka!A:J,799,10)=\"\",\"\",INDEX(Objednavka!A:J,799,10))","v":""}]
[null,{"$f":"IF(INDEX(Objednavka!A:I,800,3)=\"\",INDEX(Objednavka!A:I,800,1),INDEX(Objednavka!A:I,800,3))","v":0},null,null,null,null,null,{"$f":"INDEX(Objednavka!A:I,800,4)","v":0},null,{"$f":"INDEX(Objednavka!A:I,800,5)","v":0},{"$f":"INDEX(Objednavka!A:I,800,7)","v":0},{"$f":"INDEX(Objednavka!A:I,800,8)","v":0},null,{"$f":"IF(INDEX(Objednavka!A:J,800,10)=\"\",\"\",INDEX(Objednavka!A:J,800,10))","v":""}]
[null,{"$f":"IF(INDEX(Objednavka!A:I,801,3)=\"\",INDEX(Objednavka!A:I,801,1),INDEX(Objednavka!A:I,801,3))","v":0},null,null,null,null,null,{"$f":"INDEX(Objednavka!A:I,801,4)","v":0},null,{"$f":"INDEX(Objednavka!A:I,801,5)","v":0},{"$f":"INDEX(Objednavka!A:I,801,7)","v":0},{"$f":"INDEX(Objednavka!A:I,801,8)","v":0},null,{"$f":"IF(INDEX(Objednavka!A:J,801,10)=\"\",\"\",INDEX(Objednavka!A:J,801,10))","v":""}]
[null,{"$f":"IF(INDEX(Objednavka!A:I,802,3)=\"\",INDEX(Objednavka!A:I,802,1),INDEX(Objednavka!A:I,802,3))","v":0},null,null,null,null,null,{"$f":"INDEX(Objednavka!A:I,802,4)","v":0},null,{"$f":"INDEX(Objednavka!A:I,802,5)","v":0},{"$f":"INDEX(Objednavka!A:I,802,7)","v":0},{"$f":"INDEX(Objednavka!A:I,802,8)","v":0},null,{"$f":"IF(INDEX(Objednavka!A:J,802,10)=\"\",\"\",INDEX(Objednavka!A:J,802,10))","v":""}]
[null,{"$f":"IF(INDEX(Objednavka!A:I,803,3)=\"\",INDEX(Objednavka!A:I,803,1),INDEX(Objednavka!A:I,803,3))","v":0},null,null,null,null,null,{"$f":"INDEX(Objednavka!A:I,803,4)","v":0},null,{"$f":"INDEX(Objednavka!A:I,803,5)","v":0},{"$f":"INDEX(Objednavka!A:I,803,7)","v":0},{"$f":"INDEX(Objednavka!A:I,803,8)","v":0},null,{"$f":"IF(INDEX(Objednavka!A:J,803,10)=\"\",\"\",INDEX(Objednavka!A:J,803,10))","v":""}]
[null,{"$f":"IF(INDEX(Objednavka!A:I,804,3)=\"\",INDEX(Objednavka!A:I,804,1),INDEX(Objednavka!A:I,804,3))","v":0},null,null,null,null,null,{"$f":"INDEX(Objednavka!A:I,804,4)","v":0},null,{"$f":"INDEX(Objednavka!A:I,804,5)","v":0},{"$f":"INDEX(Objednavka!A:I,804,7)","v":0},{"$f":"INDEX(Objednavka!A:I,804,8)","v":0},null,{"$f":"IF(INDEX(Objednavka!A:J,804,10)=\"\",\"\",INDEX(Objednavka!A:J,804,10))","v":""}]
[null,{"$f":"IF(INDEX(Objednavka!A:I,805,3)=\"\",INDEX(Objednavka!A:I,805,1),INDEX(Objednavka!A:I,805,3))","v":0},null,null,null,null,null,{"$f":"INDEX(Objednavka!A:I,805,4)","v":0},null,{"$f":"INDEX(Objednavka!A:I,805,5)","v":0},{"$f":"INDEX(Objednavka!A:I,805,7)","v":0},{"$f":"INDEX(Objednavka!A:I,805,8)","v":0},null,{"$f":"IF(INDEX(Objednavka!A:J,805,10)=\"\",\"\",INDEX(Objednavka!A:J,805,10))","v":""}]
[null,{"$f":"IF(INDEX(Objednavka!A:I,806,3)=\"\",INDEX(Objednavka!A:I,806,1),INDEX(Objednavka!A:I,806,3))","v":0},null,null,null,null,null,{"$f":"INDEX(Objednavka!A:I,806,4)","v":0},null,{"$f":"INDEX(Objednavka!A:I,806,5)","v":0},{"$f":"INDEX(Objednavka!A:I,806,7)","v":0},{"$f":"INDEX(Objednavka!A:I,806,8)","v":0},null,{"$f":"IF(INDEX(Objednavka!A:J,806,10)=\"\",\"\",INDEX(Objednavka!A:J,806,10))","v":""}]
[null,{"$f":"IF(INDEX(Objednavka!A:I,807,3)=\"\",INDEX(Objednavka!A:I,807,1),INDEX(Objednavka!A:I,807,3))","v":0},null,null,null,null,null,{"$f":"INDEX(Objednavka!A:I,807,4)","v":0},null,{"$f":"INDEX(Objednavka!A:I,807,5)","v":0},{"$f":"INDEX(Objednavka!A:I,807,7)","v":0},{"$f":"INDEX(Objednavka!A:I,807,8)","v":0},null,{"$f":"IF(INDEX(Objednavka!A:J,807,10)=\"\",\"\",INDEX(Objednavka!A:J,807,10))","v":""}]
[null,{"$f":"IF(INDEX(Objednavka!A:I,808,3)=\"\",INDEX(Objednavka!A:I,808,1),INDEX(Objednavka!A:I,808,3))","v":0},null,null,null,null,null,{"$f":"INDEX(Objednavka!A:I,808,4)","v":0},null,{"$f":"INDEX(Objednavka!A:I,808,5)","v":0},{"$f":"INDEX(Objednavka!A:I,808,7)","v":0},{"$f":"INDEX(Objednavka!A:I,808,8)","v":0},null,{"$f":"IF(INDEX(Objednavka!A:J,808,10)=\"\",\"\",INDEX(Objednavka!A:J,808,10))","v":""}]
[null,{"$f":"IF(INDEX(Objednavka!A:I,809,3)=\"\",INDEX(Objednavka!A:I,809,1),INDEX(Objednavka!A:I,809,3))","v":0},null,null,null,null,null,{"$f":"INDEX(Objednavka!A:I,809,4)","v":0},null,{"$f":"INDEX(Objednavka!A:I,809,5)","v":0},{"$f":"INDEX(Objednavka!A:I,809,7)","v":0},{"$f":"INDEX(Objednavka!A:I,809,8)","v":0},null,{"$f":"IF(INDEX(Objednavka!A:J,809,10)=\"\",\"\",INDEX(Objednavka!A:J,809,10))","v":""}]
[null,{"$f":"IF(INDEX(Objednavka!A:I,810,3)=\"\",INDEX(Objednavka!A:I,810,1),INDEX(Objednavka!A:I,810,3))","v":0},null,null,null,null,null,{"$f":"INDEX(Objednavka!A:I,810,4)","v":0},null,{"$f":"INDEX(Objednavka!A:I,810,5)","v":0},{"$f":"INDEX(Objednavka!A:I,810,7)","v":0},{"$f":"INDEX(Objednavka!A:I,810,8)","v":0},null,{"$f":"IF(INDEX(Objednavka!A:J,810,10)=\"\",\"\",INDEX(Objednavka!A:J,810,10))","v":""}]
[null,{"$f":"IF(INDEX(Objednavka!A:I,811,3)=\"\",INDEX(Objednavka!A:I,811,1),INDEX(Objednavka!A:I,811,3))","v":0},null,null,null,null,null,{"$f":"INDEX(Objednavka!A:I,811,4)","v":0},null,{"$f":"INDEX(Objednavka!A:I,811,5)","v":0},{"$f":"INDEX(Objednavka!A:I,811,7)","v":0},{"$f":"INDEX(Objednavka!A:I,811,8)","v":0},null,{"$f":"IF(INDEX(Objednavka!A:J,811,10)=\"\",\"\",INDEX(Objednavka!A:J,811,10))","v":""}]
[null,{"$f":"IF(INDEX(Objednavka!A:I,812,3)=\"\",INDEX(Objednavka!A:I,812,1),INDEX(Objednavka!A:I,812,3))","v":0},null,null,null,null,null,{"$f":"INDEX(Objednavka!A:I,812,4)","v":0},null,{"$f":"INDEX(Objednavka!A:I,812,5)","v":0},{"$f":"INDEX(Objednavka!A:I,812,7)","v":0},{"$f":"INDEX(Objednavka!A:I,812,8)","v":0},null,{"$f":"IF(INDEX(Objednavka!A:J,812,10)=\"\",\"\",INDEX(Objednavka!A:J,812,10))","v":""}]
[null,{"$f":"IF(INDEX(Objednavka!A:I,813,3)=\"\",INDEX(Objednavka!A:I,813,1),INDEX(Objednavka!A:I,813,3))","v":0},null,null,null,null,null,{"$f":"INDEX(Objednavka!A:I,813,4)","v":0},null,{"$f":"INDEX(Objednavka!A:I,813,5)","v":0},{"$f":"INDEX(Objednavka!A:I,813,7)","v":0},{"$f":"INDEX(Objednavka!A:I,813,8)","v":0},null,{"$f":"IF(INDEX(Objednavka!A:J,813,10)=\"\",\"\",INDEX(Objednavka!A:J,813,10))","v":""}]
[null,{"$f":"IF(INDEX(Objednavka!A:I,814,3)=\"\",INDEX(Objednavka!A:I,814,1),INDEX(Objednavka!A:I,814,3))","v":0},null,null,null,null,null,{"$f":"INDEX(Objednavka!A:I,814,4)","v":0},null,{"$f":"INDEX(Objednavka!A:I,814,5)","v":0},{"$f":"INDEX(Objednavka!A:I,814,7)","v":0},{"$f":"INDEX(Objednavka!A:I,814,8)","v":0},null,{"$f":"IF(INDEX(Objednavka!A:J,814,10)=\"\",\"\",INDEX(Objednavka!A:J,814,10))","v":""}]
[null,{"$f":"IF(INDEX(Objednavka!A:I,815,3)=\"\",INDEX(Objednavka!A:I,815,1),INDEX(Objednavka!A:I,815,3))","v":0},null,null,null,null,null,{"$f":"INDEX(Objednavka!A:I,815,4)","v":0},null,{"$f":"INDEX(Objednavka!A:I,815,5)","v":0},{"$f":"INDEX(Objednavka!A:I,815,7)","v":0},{"$f":"INDEX(Objednavka!A:I,815,8)","v":0},null,{"$f":"IF(INDEX(Objednavka!A:J,815,10)=\"\",\"\",INDEX(Objednavka!A:J,815,10))","v":""}]
[null,{"$f":"IF(INDEX(Objednavka!A:I,816,3)=\"\",INDEX(Objednavka!A:I,816,1),INDEX(Objednavka!A:I,816,3))","v":0},null,null,null,null,null,{"$f":"INDEX(Objednavka!A:I,816,4)","v":0},null,{"$f":"INDEX(Objednavka!A:I,816,5)","v":0},{"$f":"INDEX(Objednavka!A:I,816,7)","v":0},{"$f":"INDEX(Objednavka!A:I,816,8)","v":0},null,{"$f":"IF(INDEX(Objednavka!A:J,816,10)=\"\",\"\",INDEX(Objednavka!A:J,816,10))","v":""}]
[null,{"$f":"IF(INDEX(Objednavka!A:I,817,3)=\"\",INDEX(Objednavka!A:I,817,1),INDEX(Objednavka!A:I,817,3))","v":0},null,null,null,null,null,{"$f":"INDEX(Objednavka!A:I,817,4)","v":0},null,{"$f":"INDEX(Objednavka!A:I,817,5)","v":0},{"$f":"INDEX(Objednavka!A:I,817,7)","v":0},{"$f":"INDEX(Objednavka!A:I,817,8)","v":0},null,{"$f":"IF(INDEX(Objednavka!A:J,817,10)=\"\",\"\",INDEX(Objednavka!A:J,817,10))","v":""}]
[null,{"$f":"IF(INDEX(Objednavka!A:I,818,3)=\"\",INDEX(Objednavka!A:I,818,1),INDEX(Objednavka!A:I,818,3))","v":0},null,null,null,null,null,{"$f":"INDEX(Objednavka!A:I,818,4)","v":0},null,{"$f":"INDEX(Objednavka!A:I,818,5)","v":0},{"$f":"INDEX(Objednavka!A:I,818,7)","v":0},{"$f":"INDEX(Objednavka!A:I,818,8)","v":0},null,{"$f":"IF(INDEX(Objednavka!A:J,818,10)=\"\",\"\",INDEX(Objednavka!A:J,818,10))","v":""}]
[null,{"$f":"IF(INDEX(Objednavka!A:I,819,3)=\"\",INDEX(Objednavka!A:I,819,1),INDEX(Objednavka!A:I,819,3))","v":0},null,null,null,null,null,{"$f":"INDEX(Objednavka!A:I,819,4)","v":0},null,{"$f":"INDEX(Objednavka!A:I,819,5)","v":0},{"$f":"INDEX(Objednavka!A:I,819,7)","v":0},{"$f":"INDEX(Objednavka!A:I,819,8)","v":0},null,{"$f":"IF(INDEX(Objednavka!A:J,819,10)=\"\",\"\",INDEX(Objednavka!A:J,819,10))","v":""}]
[null,{"$f":"IF(INDEX(Objednavka!A:I,820,3)=\"\",INDEX(Objednavka!A:I,820,1),INDEX(Objednavka!A:I,820,3))","v":0},null,null,null,null,null,{"$f":"INDEX(Objednavka!A:I,820,4)","v":0},null,{"$f":"INDEX(Objednavka!A:I,820,5)","v":0},{"$f":"INDEX(Objednavka!A:I,820,7)","v":0},{"$f":"INDEX(Objednavka!A:I,820,8)","v":0},null,{"$f":"IF(INDEX(Objednavka!A:J,820,10)=\"\",\"\",INDEX(Objednavka!A:J,820,10))","v":""}]
[null,{"$f":"IF(INDEX(Objednavka!A:I,821,3)=\"\",INDEX(Objednavka!A:I,821,1),INDEX(Objednavka!A:I,821,3))","v":0},null,null,null,null,null,{"$f":"INDEX(Objednavka!A:I,821,4)","v":0},null,{"$f":"INDEX(Objednavka!A:I,821,5)","v":0},{"$f":"INDEX(Objednavka!A:I,821,7)","v":0},{"$f":"INDEX(Objednavka!A:I,821,8)","v":0},null,{"$f":"IF(INDEX(Objednavka!A:J,821,10)=\"\",\"\",INDEX(Objednavka!A:J,821,10))","v":""}]
[null,{"$f":"IF(INDEX(Objednavka!A:I,822,3)=\"\",INDEX(Objednavka!A:I,822,1),INDEX(Objednavka!A:I,822,3))","v":0},null,null,null,null,null,{"$f":"INDEX(Objednavka!A:I,822,4)","v":0},null,{"$f":"INDEX(Objednavka!A:I,822,5)","v":0},{"$f":"INDEX(Objednavka!A:I,822,7)","v":0},{"$f":"INDEX(Objednavka!A:I,822,8)","v":0},null,{"$f":"IF(INDEX(Objednavka!A:J,822,10)=\"\",\"\",INDEX(Objednavka!A:J,822,10))","v":""}]
[null,{"$f":"IF(INDEX(Objednavka!A:I,823,3)=\"\",INDEX(Objednavka!A:I,823,1),INDEX(Objednavka!A:I,823,3))","v":0},null,null,null,null,null,{"$f":"INDEX(Objednavka!A:I,823,4)","v":0},null,{"$f":"INDEX(Objednavka!A:I,823,5)","v":0},{"$f":"INDEX(Objednavka!A:I,823,7)","v":0},{"$f":"INDEX(Objednavka!A:I,823,8)","v":0},null,{"$f":"IF(INDEX(Objednavka!A:J,823,10)=\"\",\"\",INDEX(Objednavka!A:J,823,10))","v":""}]
[null,{"$f":"IF(INDEX(Objednavka!A:I,824,3)=\"\",INDEX(Objednavka!A:I,824,1),INDEX(Objednavka!A:I,824,3))","v":0},null,null,null,null,null,{"$f":"INDEX(Objednavka!A:I,824,4)","v":0},null,{"$f":"INDEX(Objednavka!A:I,824,5)","v":0},{"$f":"INDEX(Objednavka!A:I,824,7)","v":0},{"$f":"INDEX(Objednavka!A:I,824,8)","v":0},null,{"$f":"IF(INDEX(Objednavka!A:J,824,10)=\"\",\"\",INDEX(Objednavka!A:J,824,10))","v":""}]
[null,{"$f":"IF(INDEX(Objednavka!A:I,825,3)=\"\",INDEX(Objednavka!A:I,825,1),INDEX(Objednavka!A:I,825,3))","v":0},null,null,null,null,null,{"$f":"INDEX(Objednavka!A:I,825,4)","v":0},null,{"$f":"INDEX(Objednavka!A:I,825,5)","v":0},{"$f":"INDEX(Objednavka!A:I,825,7)","v":0},{"$f":"INDEX(Objednavka!A:I,825,8)","v":0},null,{"$f":"IF(INDEX(Objednavka!A:J,825,10)=\"\",\"\",INDEX(Objednavka!A:J,825,10))","v":""}]
[null,{"$f":"IF(INDEX(Objednavka!A:I,826,3)=\"\",INDEX(Objednavka!A:I,826,1),INDEX(Objednavka!A:I,826,3))","v":0},null,null,null,null,null,{"$f":"INDEX(Objednavka!A:I,826,4)","v":0},null,{"$f":"INDEX(Objednavka!A:I,826,5)","v":0},{"$f":"INDEX(Objednavka!A:I,826,7)","v":0},{"$f":"INDEX(Objednavka!A:I,826,8)","v":0},null,{"$f":"IF(INDEX(Objednavka!A:J,826,10)=\"\",\"\",INDEX(Objednavka!A:J,826,10))","v":""}]
[null,{"$f":"IF(INDEX(Objednavka!A:I,827,3)=\"\",INDEX(Objednavka!A:I,827,1),INDEX(Objednavka!A:I,827,3))","v":0},null,null,null,null,null,{"$f":"INDEX(Objednavka!A:I,827,4)","v":0},null,{"$f":"INDEX(Objednavka!A:I,827,5)","v":0},{"$f":"INDEX(Objednavka!A:I,827,7)","v":0},{"$f":"INDEX(Objednavka!A:I,827,8)","v":0},null,{"$f":"IF(INDEX(Objednavka!A:J,827,10)=\"\",\"\",INDEX(Objednavka!A:J,827,10))","v":""}]
[null,{"$f":"IF(INDEX(Objednavka!A:I,828,3)=\"\",INDEX(Objednavka!A:I,828,1),INDEX(Objednavka!A:I,828,3))","v":0},null,null,null,null,null,{"$f":"INDEX(Objednavka!A:I,828,4)","v":0},null,{"$f":"INDEX(Objednavka!A:I,828,5)","v":0},{"$f":"INDEX(Objednavka!A:I,828,7)","v":0},{"$f":"INDEX(Objednavka!A:I,828,8)","v":0},null,{"$f":"IF(INDEX(Objednavka!A:J,828,10)=\"\",\"\",INDEX(Objednavka!A:J,828,10))","v":""}]
[null,{"$f":"IF(INDEX(Objednavka!A:I,829,3)=\"\",INDEX(Objednavka!A:I,829,1),INDEX(Objednavka!A:I,829,3))","v":0},null,null,null,null,null,{"$f":"INDEX(Objednavka!A:I,829,4)","v":0},null,{"$f":"INDEX(Objednavka!A:I,829,5)","v":0},{"$f":"INDEX(Objednavka!A:I,829,7)","v":0},{"$f":"INDEX(Objednavka!A:I,829,8)","v":0},null,{"$f":"IF(INDEX(Objednavka!A:J,829,10)=\"\",\"\",INDEX(Objednavka!A:J,829,10))","v":""}]
[null,{"$f":"IF(INDEX(Objednavka!A:I,830,3)=\"\",INDEX(Objednavka!A:I,830,1),INDEX(Objednavka!A:I,830,3))","v":0},null,null,null,null,null,{"$f":"INDEX(Objednavka!A:I,830,4)","v":0},null,{"$f":"INDEX(Objednavka!A:I,830,5)","v":0},{"$f":"INDEX(Objednavka!A:I,830,7)","v":0},{"$f":"INDEX(Objednavka!A:I,830,8)","v":0},null,{"$f":"IF(INDEX(Objednavka!A:J,830,10)=\"\",\"\",INDEX(Objednavka!A:J,830,10))","v":""}]
[null,{"$f":"IF(INDEX(Objednavka!A:I,831,3)=\"\",INDEX(Objednavka!A:I,831,1),INDEX(Objednavka!A:I,831,3))","v":0},null,null,null,null,null,{"$f":"INDEX(Objednavka!A:I,831,4)","v":0},null,{"$f":"INDEX(Objednavka!A:I,831,5)","v":0},{"$f":"INDEX(Objednavka!A:I,831,7)","v":0},{"$f":"INDEX(Objednavka!A:I,831,8)","v":0},null,{"$f":"IF(INDEX(Objednavka!A:J,831,10)=\"\",\"\",INDEX(Objednavka!A:J,831,10))","v":""}]
[null,{"$f":"IF(INDEX(Objednavka!A:I,832,3)=\"\",INDEX(Objednavka!A:I,832,1),INDEX(Objednavka!A:I,832,3))","v":0},null,null,null,null,null,{"$f":"INDEX(Objednavka!A:I,832,4)","v":0},null,{"$f":"INDEX(Objednavka!A:I,832,5)","v":0},{"$f":"INDEX(Objednavka!A:I,832,7)","v":0},{"$f":"INDEX(Objednavka!A:I,832,8)","v":0},null,{"$f":"IF(INDEX(Objednavka!A:J,832,10)=\"\",\"\",INDEX(Objednavka!A:J,832,10))","v":""}]
[null,{"$f":"IF(INDEX(Objednavka!A:I,833,3)=\"\",INDEX(Objednavka!A:I,833,1),INDEX(Objednavka!A:I,833,3))","v":0},null,null,null,null,null,{"$f":"INDEX(Objednavka!A:I,833,4)","v":0},null,{"$f":"INDEX(Objednavka!A:I,833,5)","v":0},{"$f":"INDEX(Objednavka!A:I,833,7)","v":0},{"$f":"INDEX(Objednavka!A:I,833,8)","v":0},null,{"$f":"IF(INDEX(Objednavka!A:J,833,10)=\"\",\"\",INDEX(Objednavka!A:J,833,10))","v":""}]
[null,{"$f":"IF(INDEX(Objednavka!A:I,834,3)=\"\",INDEX(Objednavka!A:I,834,1),INDEX(Objednavka!A:I,834,3))","v":0},null,null,null,null,null,{"$f":"INDEX(Objednavka!A:I,834,4)","v":0},null,{"$f":"INDEX(Objednavka!A:I,834,5)","v":0},{"$f":"INDEX(Objednavka!A:I,834,7)","v":0},{"$f":"INDEX(Objednavka!A:I,834,8)","v":0},null,{"$f":"IF(INDEX(Objednavka!A:J,834,10)=\"\",\"\",INDEX(Objednavka!A:J,834,10))","v":""}]
[null,{"$f":"IF(INDEX(Objednavka!A:I,835,3)=\"\",INDEX(Objednavka!A:I,835,1),INDEX(Objednavka!A:I,835,3))","v":0},null,null,null,null,null,{"$f":"INDEX(Objednavka!A:I,835,4)","v":0},null,{"$f":"INDEX(Objednavka!A:I,835,5)","v":0},{"$f":"INDEX(Objednavka!A:I,835,7)","v":0},{"$f":"INDEX(Objednavka!A:I,835,8)","v":0},null,{"$f":"IF(INDEX(Objednavka!A:J,835,10)=\"\",\"\",INDEX(Objednavka!A:J,835,10))","v":""}]
[null,{"$f":"IF(INDEX(Objednavka!A:I,836,3)=\"\",INDEX(Objednavka!A:I,836,1),INDEX(Objednavka!A:I,836,3))","v":0},null,null,null,null,null,{"$f":"INDEX(Objednavka!A:I,836,4)","v":0},null,{"$f":"INDEX(Objednavka!A:I,836,5)","v":0},{"$f":"INDEX(Objednavka!A:I,836,7)","v":0},{"$f":"INDEX(Objednavka!A:I,836,8)","v":0},null,{"$f":"IF(INDEX(Objednavka!A:J,836,10)=\"\",\"\",INDEX(Objednavka!A:J,836,10))","v":""}]
[null,{"$f":"IF(INDEX(Objednavka!A:I,837,3)=\"\",INDEX(Objednavka!A:I,837,1),INDEX(Objednavka!A:I,837,3))","v":0},null,null,null,null,null,{"$f":"INDEX(Objednavka!A:I,837,4)","v":0},null,{"$f":"INDEX(Objednavka!A:I,837,5)","v":0},{"$f":"INDEX(Objednavka!A:I,837,7)","v":0},{"$f":"INDEX(Objednavka!A:I,837,8)","v":0},null,{"$f":"IF(INDEX(Objednavka!A:J,837,10)=\"\",\"\",INDEX(Objednavka!A:J,837,10))","v":""}]
[null,{"$f":"IF(INDEX(Objednavka!A:I,838,3)=\"\",INDEX(Objednavka!A:I,838,1),INDEX(Objednavka!A:I,838,3))","v":0},null,null,null,null,null,{"$f":"INDEX(Objednavka!A:I,838,4)","v":0},null,{"$f":"INDEX(Objednavka!A:I,838,5)","v":0},{"$f":"INDEX(Objednavka!A:I,838,7)","v":0},{"$f":"INDEX(Objednavka!A:I,838,8)","v":0},null,{"$f":"IF(INDEX(Objednavka!A:J,838,10)=\"\",\"\",INDEX(Objednavka!A:J,838,10))","v":""}]
[null,{"$f":"IF(INDEX(Objednavka!A:I,839,3)=\"\",INDEX(Objednavka!A:I,839,1),INDEX(Objednavka!A:I,839,3))","v":0},null,null,null,null,null,{"$f":"INDEX(Objednavka!A:I,839,4)","v":0},null,{"$f":"INDEX(Objednavka!A:I,839,5)","v":0},{"$f":"INDEX(Objednavka!A:I,839,7)","v":0},{"$f":"INDEX(Objednavka!A:I,839,8)","v":0},null,{"$f":"IF(INDEX(Objednavka!A:J,839,10)=\"\",\"\",INDEX(Objednavka!A:J,839,10))","v":""}]
[null,{"$f":"IF(INDEX(Objednavka!A:I,840,3)=\"\",INDEX(Objednavka!A:I,840,1),INDEX(Objednavka!A:I,840,3))","v":0},null,null,null,null,null,{"$f":"INDEX(Objednavka!A:I,840,4)","v":0},null,{"$f":"INDEX(Objednavka!A:I,840,5)","v":0},{"$f":"INDEX(Objednavka!A:I,840,7)","v":0},{"$f":"INDEX(Objednavka!A:I,840,8)","v":0},null,{"$f":"IF(INDEX(Objednavka!A:J,840,10)=\"\",\"\",INDEX(Objednavka!A:J,840,10))","v":""}]
[null,{"$f":"IF(INDEX(Objednavka!A:I,841,3)=\"\",INDEX(Objednavka!A:I,841,1),INDEX(Objednavka!A:I,841,3))","v":0},null,null,null,null,null,{"$f":"INDEX(Objednavka!A:I,841,4)","v":0},null,{"$f":"INDEX(Objednavka!A:I,841,5)","v":0},{"$f":"INDEX(Objednavka!A:I,841,7)","v":0},{"$f":"INDEX(Objednavka!A:I,841,8)","v":0},null,{"$f":"IF(INDEX(Objednavka!A:J,841,10)=\"\",\"\",INDEX(Objednavka!A:J,841,10))","v":""}]
[null,{"$f":"IF(INDEX(Objednavka!A:I,842,3)=\"\",INDEX(Objednavka!A:I,842,1),INDEX(Objednavka!A:I,842,3))","v":0},null,null,null,null,null,{"$f":"INDEX(Objednavka!A:I,842,4)","v":0},null,{"$f":"INDEX(Objednavka!A:I,842,5)","v":0},{"$f":"INDEX(Objednavka!A:I,842,7)","v":0},{"$f":"INDEX(Objednavka!A:I,842,8)","v":0},null,{"$f":"IF(INDEX(Objednavka!A:J,842,10)=\"\",\"\",INDEX(Objednavka!A:J,842,10))","v":""}]
[null,{"$f":"IF(INDEX(Objednavka!A:I,843,3)=\"\",INDEX(Objednavka!A:I,843,1),INDEX(Objednavka!A:I,843,3))","v":0},null,null,null,null,null,{"$f":"INDEX(Objednavka!A:I,843,4)","v":0},null,{"$f":"INDEX(Objednavka!A:I,843,5)","v":0},{"$f":"INDEX(Objednavka!A:I,843,7)","v":0},{"$f":"INDEX(Objednavka!A:I,843,8)","v":0},null,{"$f":"IF(INDEX(Objednavka!A:J,843,10)=\"\",\"\",INDEX(Objednavka!A:J,843,10))","v":""}]
[null,{"$f":"IF(INDEX(Objednavka!A:I,844,3)=\"\",INDEX(Objednavka!A:I,844,1),INDEX(Objednavka!A:I,844,3))","v":0},null,null,null,null,null,{"$f":"INDEX(Objednavka!A:I,844,4)","v":0},null,{"$f":"INDEX(Objednavka!A:I,844,5)","v":0},{"$f":"INDEX(Objednavka!A:I,844,7)","v":0},{"$f":"INDEX(Objednavka!A:I,844,8)","v":0},null,{"$f":"IF(INDEX(Objednavka!A:J,844,10)=\"\",\"\",INDEX(Objednavka!A:J,844,10))","v":""}]
[null,{"$f":"IF(INDEX(Objednavka!A:I,845,3)=\"\",INDEX(Objednavka!A:I,845,1),INDEX(Objednavka!A:I,845,3))","v":0},null,null,null,null,null,{"$f":"INDEX(Objednavka!A:I,845,4)","v":0},null,{"$f":"INDEX(Objednavka!A:I,845,5)","v":0},{"$f":"INDEX(Objednavka!A:I,845,7)","v":0},{"$f":"INDEX(Objednavka!A:I,845,8)","v":0},null,{"$f":"IF(INDEX(Objednavka!A:J,845,10)=\"\",\"\",INDEX(Objednavka!A:J,845,10))","v":""}]
[null,{"$f":"IF(INDEX(Objednavka!A:I,846,3)=\"\",INDEX(Objednavka!A:I,846,1),INDEX(Objednavka!A:I,846,3))","v":0},null,null,null,null,null,{"$f":"INDEX(Objednavka!A:I,846,4)","v":0},null,{"$f":"INDEX(Objednavka!A:I,846,5)","v":0},{"$f":"INDEX(Objednavka!A:I,846,7)","v":0},{"$f":"INDEX(Objednavka!A:I,846,8)","v":0},null,{"$f":"IF(INDEX(Objednavka!A:J,846,10)=\"\",\"\",INDEX(Objednavka!A:J,846,10))","v":""}]
[null,{"$f":"IF(INDEX(Objednavka!A:I,847,3)=\"\",INDEX(Objednavka!A:I,847,1),INDEX(Objednavka!A:I,847,3))","v":0},null,null,null,null,null,{"$f":"INDEX(Objednavka!A:I,847,4)","v":0},null,{"$f":"INDEX(Objednavka!A:I,847,5)","v":0},{"$f":"INDEX(Objednavka!A:I,847,7)","v":0},{"$f":"INDEX(Objednavka!A:I,847,8)","v":0},null,{"$f":"IF(INDEX(Objednavka!A:J,847,10)=\"\",\"\",INDEX(Objednavka!A:J,847,10))","v":""}]
[null,{"$f":"IF(INDEX(Objednavka!A:I,848,3)=\"\",INDEX(Objednavka!A:I,848,1),INDEX(Objednavka!A:I,848,3))","v":0},null,null,null,null,null,{"$f":"INDEX(Objednavka!A:I,848,4)","v":0},null,{"$f":"INDEX(Objednavka!A:I,848,5)","v":0},{"$f":"INDEX(Objednavka!A:I,848,7)","v":0},{"$f":"INDEX(Objednavka!A:I,848,8)","v":0},null,{"$f":"IF(INDEX(Objednavka!A:J,848,10)=\"\",\"\",INDEX(Objednavka!A:J,848,10))","v":""}]
[null,{"$f":"IF(INDEX(Objednavka!A:I,849,3)=\"\",INDEX(Objednavka!A:I,849,1),INDEX(Objednavka!A:I,849,3))","v":0},null,null,null,null,null,{"$f":"INDEX(Objednavka!A:I,849,4)","v":0},null,{"$f":"INDEX(Objednavka!A:I,849,5)","v":0},{"$f":"INDEX(Objednavka!A:I,849,7)","v":0},{"$f":"INDEX(Objednavka!A:I,849,8)","v":0},null,{"$f":"IF(INDEX(Objednavka!A:J,849,10)=\"\",\"\",INDEX(Objednavka!A:J,849,10))","v":""}]
[null,{"$f":"IF(INDEX(Objednavka!A:I,850,3)=\"\",INDEX(Objednavka!A:I,850,1),INDEX(Objednavka!A:I,850,3))","v":0},null,null,null,null,null,{"$f":"INDEX(Objednavka!A:I,850,4)","v":0},null,{"$f":"INDEX(Objednavka!A:I,850,5)","v":0},{"$f":"INDEX(Objednavka!A:I,850,7)","v":0},{"$f":"INDEX(Objednavka!A:I,850,8)","v":0},null,{"$f":"IF(INDEX(Objednavka!A:J,850,10)=\"\",\"\",INDEX(Objednavka!A:J,850,10))","v":""}]
[null,{"$f":"IF(INDEX(Objednavka!A:I,851,3)=\"\",INDEX(Objednavka!A:I,851,1),INDEX(Objednavka!A:I,851,3))","v":0},null,null,null,null,null,{"$f":"INDEX(Objednavka!A:I,851,4)","v":0},null,{"$f":"INDEX(Objednavka!A:I,851,5)","v":0},{"$f":"INDEX(Objednavka!A:I,851,7)","v":0},{"$f":"INDEX(Objednavka!A:I,851,8)","v":0},null,{"$f":"IF(INDEX(Objednavka!A:J,851,10)=\"\",\"\",INDEX(Objednavka!A:J,851,10))","v":""}]
[null,{"$f":"IF(INDEX(Objednavka!A:I,852,3)=\"\",INDEX(Objednavka!A:I,852,1),INDEX(Objednavka!A:I,852,3))","v":0},null,null,null,null,null,{"$f":"INDEX(Objednavka!A:I,852,4)","v":0},null,{"$f":"INDEX(Objednavka!A:I,852,5)","v":0},{"$f":"INDEX(Objednavka!A:I,852,7)","v":0},{"$f":"INDEX(Objednavka!A:I,852,8)","v":0},null,{"$f":"IF(INDEX(Objednavka!A:J,852,10)=\"\",\"\",INDEX(Objednavka!A:J,852,10))","v":""}]
[null,{"$f":"IF(INDEX(Objednavka!A:I,853,3)=\"\",INDEX(Objednavka!A:I,853,1),INDEX(Objednavka!A:I,853,3))","v":0},null,null,null,null,null,{"$f":"INDEX(Objednavka!A:I,853,4)","v":0},null,{"$f":"INDEX(Objednavka!A:I,853,5)","v":0},{"$f":"INDEX(Objednavka!A:I,853,7)","v":0},{"$f":"INDEX(Objednavka!A:I,853,8)","v":0},null,{"$f":"IF(INDEX(Objednavka!A:J,853,10)=\"\",\"\",INDEX(Objednavka!A:J,853,10))","v":""}]
[null,{"$f":"IF(INDEX(Objednavka!A:I,854,3)=\"\",INDEX(Objednavka!A:I,854,1),INDEX(Objednavka!A:I,854,3))","v":0},null,null,null,null,null,{"$f":"INDEX(Objednavka!A:I,854,4)","v":0},null,{"$f":"INDEX(Objednavka!A:I,854,5)","v":0},{"$f":"INDEX(Objednavka!A:I,854,7)","v":0},{"$f":"INDEX(Objednavka!A:I,854,8)","v":0},null,{"$f":"IF(INDEX(Objednavka!A:J,854,10)=\"\",\"\",INDEX(Objednavka!A:J,854,10))","v":""}]
[null,{"$f":"IF(INDEX(Objednavka!A:I,855,3)=\"\",INDEX(Objednavka!A:I,855,1),INDEX(Objednavka!A:I,855,3))","v":0},null,null,null,null,null,{"$f":"INDEX(Objednavka!A:I,855,4)","v":0},null,{"$f":"INDEX(Objednavka!A:I,855,5)","v":0},{"$f":"INDEX(Objednavka!A:I,855,7)","v":0},{"$f":"INDEX(Objednavka!A:I,855,8)","v":0},null,{"$f":"IF(INDEX(Objednavka!A:J,855,10)=\"\",\"\",INDEX(Objednavka!A:J,855,10))","v":""}]
[null,{"$f":"IF(INDEX(Objednavka!A:I,856,3)=\"\",INDEX(Objednavka!A:I,856,1),INDEX(Objednavka!A:I,856,3))","v":0},null,null,null,null,null,{"$f":"INDEX(Objednavka!A:I,856,4)","v":0},null,{"$f":"INDEX(Objednavka!A:I,856,5)","v":0},{"$f":"INDEX(Objednavka!A:I,856,7)","v":0},{"$f":"INDEX(Objednavka!A:I,856,8)","v":0},null,{"$f":"IF(INDEX(Objednavka!A:J,856,10)=\"\",\"\",INDEX(Objednavka!A:J,856,10))","v":""}]
[null,{"$f":"IF(INDEX(Objednavka!A:I,857,3)=\"\",INDEX(Objednavka!A:I,857,1),INDEX(Objednavka!A:I,857,3))","v":0},null,null,null,null,null,{"$f":"INDEX(Objednavka!A:I,857,4)","v":0},null,{"$f":"INDEX(Objednavka!A:I,857,5)","v":0},{"$f":"INDEX(Objednavka!A:I,857,7)","v":0},{"$f":"INDEX(Objednavka!A:I,857,8)","v":0},null,{"$f":"IF(INDEX(Objednavka!A:J,857,10)=\"\",\"\",INDEX(Objednavka!A:J,857,10))","v":""}]
[null,{"$f":"IF(INDEX(Objednavka!A:I,858,3)=\"\",INDEX(Objednavka!A:I,858,1),INDEX(Objednavka!A:I,858,3))","v":0},null,null,null,null,null,{"$f":"INDEX(Objednavka!A:I,858,4)","v":0},null,{"$f":"INDEX(Objednavka!A:I,858,5)","v":0},{"$f":"INDEX(Objednavka!A:I,858,7)","v":0},{"$f":"INDEX(Objednavka!A:I,858,8)","v":0},null,{"$f":"IF(INDEX(Objednavka!A:J,858,10)=\"\",\"\",INDEX(Objednavka!A:J,858,10))","v":""}]
[null,{"$f":"IF(INDEX(Objednavka!A:I,859,3)=\"\",INDEX(Objednavka!A:I,859,1),INDEX(Objednavka!A:I,859,3))","v":0},null,null,null,null,null,{"$f":"INDEX(Objednavka!A:I,859,4)","v":0},null,{"$f":"INDEX(Objednavka!A:I,859,5)","v":0},{"$f":"INDEX(Objednavka!A:I,859,7)","v":0},{"$f":"INDEX(Objednavka!A:I,859,8)","v":0},null,{"$f":"IF(INDEX(Objednavka!A:J,859,10)=\"\",\"\",INDEX(Objednavka!A:J,859,10))","v":""}]
[null,{"$f":"IF(INDEX(Objednavka!A:I,860,3)=\"\",INDEX(Objednavka!A:I,860,1),INDEX(Objednavka!A:I,860,3))","v":0},null,null,null,null,null,{"$f":"INDEX(Objednavka!A:I,860,4)","v":0},null,{"$f":"INDEX(Objednavka!A:I,860,5)","v":0},{"$f":"INDEX(Objednavka!A:I,860,7)","v":0},{"$f":"INDEX(Objednavka!A:I,860,8)","v":0},null,{"$f":"IF(INDEX(Objednavka!A:J,860,10)=\"\",\"\",INDEX(Objednavka!A:J,860,10))","v":""}]
[null,{"$f":"IF(INDEX(Objednavka!A:I,861,3)=\"\",INDEX(Objednavka!A:I,861,1),INDEX(Objednavka!A:I,861,3))","v":0},null,null,null,null,null,{"$f":"INDEX(Objednavka!A:I,861,4)","v":0},null,{"$f":"INDEX(Objednavka!A:I,861,5)","v":0},{"$f":"INDEX(Objednavka!A:I,861,7)","v":0},{"$f":"INDEX(Objednavka!A:I,861,8)","v":0},null,{"$f":"IF(INDEX(Objednavka!A:J,861,10)=\"\",\"\",INDEX(Objednavka!A:J,861,10))","v":""}]
[null,{"$f":"IF(INDEX(Objednavka!A:I,862,3)=\"\",INDEX(Objednavka!A:I,862,1),INDEX(Objednavka!A:I,862,3))","v":0},null,null,null,null,null,{"$f":"INDEX(Objednavka!A:I,862,4)","v":0},null,{"$f":"INDEX(Objednavka!A:I,862,5)","v":0},{"$f":"INDEX(Objednavka!A:I,862,7)","v":0},{"$f":"INDEX(Objednavka!A:I,862,8)","v":0},null,{"$f":"IF(INDEX(Objednavka!A:J,862,10)=\"\",\"\",INDEX(Objednavka!A:J,862,10))","v":""}]
[null,{"$f":"IF(INDEX(Objednavka!A:I,863,3)=\"\",INDEX(Objednavka!A:I,863,1),INDEX(Objednavka!A:I,863,3))","v":0},null,null,null,null,null,{"$f":"INDEX(Objednavka!A:I,863,4)","v":0},null,{"$f":"INDEX(Objednavka!A:I,863,5)","v":0},{"$f":"INDEX(Objednavka!A:I,863,7)","v":0},{"$f":"INDEX(Objednavka!A:I,863,8)","v":0},null,{"$f":"IF(INDEX(Objednavka!A:J,863,10)=\"\",\"\",INDEX(Objednavka!A:J,863,10))","v":""}]
[null,{"$f":"IF(INDEX(Objednavka!A:I,864,3)=\"\",INDEX(Objednavka!A:I,864,1),INDEX(Objednavka!A:I,864,3))","v":0},null,null,null,null,null,{"$f":"INDEX(Objednavka!A:I,864,4)","v":0},null,{"$f":"INDEX(Objednavka!A:I,864,5)","v":0},{"$f":"INDEX(Objednavka!A:I,864,7)","v":0},{"$f":"INDEX(Objednavka!A:I,864,8)","v":0},null,{"$f":"IF(INDEX(Objednavka!A:J,864,10)=\"\",\"\",INDEX(Objednavka!A:J,864,10))","v":""}]
[null,{"$f":"IF(INDEX(Objednavka!A:I,865,3)=\"\",INDEX(Objednavka!A:I,865,1),INDEX(Objednavka!A:I,865,3))","v":0},null,null,null,null,null,{"$f":"INDEX(Objednavka!A:I,865,4)","v":0},null,{"$f":"INDEX(Objednavka!A:I,865,5)","v":0},{"$f":"INDEX(Objednavka!A:I,865,7)","v":0},{"$f":"INDEX(Objednavka!A:I,865,8)","v":0},null,{"$f":"IF(INDEX(Objednavka!A:J,865,10)=\"\",\"\",INDEX(Objednavka!A:J,865,10))","v":""}]
[null,{"$f":"IF(INDEX(Objednavka!A:I,866,3)=\"\",INDEX(Objednavka!A:I,866,1),INDEX(Objednavka!A:I,866,3))","v":0},null,null,null,null,null,{"$f":"INDEX(Objednavka!A:I,866,4)","v":0},null,{"$f":"INDEX(Objednavka!A:I,866,5)","v":0},{"$f":"INDEX(Objednavka!A:I,866,7)","v":0},{"$f":"INDEX(Objednavka!A:I,866,8)","v":0},null,{"$f":"IF(INDEX(Objednavka!A:J,866,10)=\"\",\"\",INDEX(Objednavka!A:J,866,10))","v":""}]
[null,{"$f":"IF(INDEX(Objednavka!A:I,867,3)=\"\",INDEX(Objednavka!A:I,867,1),INDEX(Objednavka!A:I,867,3))","v":0},null,null,null,null,null,{"$f":"INDEX(Objednavka!A:I,867,4)","v":0},null,{"$f":"INDEX(Objednavka!A:I,867,5)","v":0},{"$f":"INDEX(Objednavka!A:I,867,7)","v":0},{"$f":"INDEX(Objednavka!A:I,867,8)","v":0},null,{"$f":"IF(INDEX(Objednavka!A:J,867,10)=\"\",\"\",INDEX(Objednavka!A:J,867,10))","v":""}]
[null,{"$f":"IF(INDEX(Objednavka!A:I,868,3)=\"\",INDEX(Objednavka!A:I,868,1),INDEX(Objednavka!A:I,868,3))","v":0},null,null,null,null,null,{"$f":"INDEX(Objednavka!A:I,868,4)","v":0},null,{"$f":"INDEX(Objednavka!A:I,868,5)","v":0},{"$f":"INDEX(Objednavka!A:I,868,7)","v":0},{"$f":"INDEX(Objednavka!A:I,868,8)","v":0},null,{"$f":"IF(INDEX(Objednavka!A:J,868,10)=\"\",\"\",INDEX(Objednavka!A:J,868,10))","v":""}]
[null,{"$f":"IF(INDEX(Objednavka!A:I,869,3)=\"\",INDEX(Objednavka!A:I,869,1),INDEX(Objednavka!A:I,869,3))","v":0},null,null,null,null,null,{"$f":"INDEX(Objednavka!A:I,869,4)","v":0},null,{"$f":"INDEX(Objednavka!A:I,869,5)","v":0},{"$f":"INDEX(Objednavka!A:I,869,7)","v":0},{"$f":"INDEX(Objednavka!A:I,869,8)","v":0},null,{"$f":"IF(INDEX(Objednavka!A:J,869,10)=\"\",\"\",INDEX(Objednavka!A:J,869,10))","v":""}]
[null,{"$f":"IF(INDEX(Objednavka!A:I,870,3)=\"\",INDEX(Objednavka!A:I,870,1),INDEX(Objednavka!A:I,870,3))","v":0},null,null,null,null,null,{"$f":"INDEX(Objednavka!A:I,870,4)","v":0},null,{"$f":"INDEX(Objednavka!A:I,870,5)","v":0},{"$f":"INDEX(Objednavka!A:I,870,7)","v":0},{"$f":"INDEX(Objednavka!A:I,870,8)","v":0},null,{"$f":"IF(INDEX(Objednavka!A:J,870,10)=\"\",\"\",INDEX(Objednavka!A:J,870,10))","v":""}]
[null,{"$f":"IF(INDEX(Objednavka!A:I,871,3)=\"\",INDEX(Objednavka!A:I,871,1),INDEX(Objednavka!A:I,871,3))","v":0},null,null,null,null,null,{"$f":"INDEX(Objednavka!A:I,871,4)","v":0},null,{"$f":"INDEX(Objednavka!A:I,871,5)","v":0},{"$f":"INDEX(Objednavka!A:I,871,7)","v":0},{"$f":"INDEX(Objednavka!A:I,871,8)","v":0},null,{"$f":"IF(INDEX(Objednavka!A:J,871,10)=\"\",\"\",INDEX(Objednavka!A:J,871,10))","v":""}]
[null,{"$f":"IF(INDEX(Objednavka!A:I,872,3)=\"\",INDEX(Objednavka!A:I,872,1),INDEX(Objednavka!A:I,872,3))","v":0},null,null,null,null,null,{"$f":"INDEX(Objednavka!A:I,872,4)","v":0},null,{"$f":"INDEX(Objednavka!A:I,872,5)","v":0},{"$f":"INDEX(Objednavka!A:I,872,7)","v":0},{"$f":"INDEX(Objednavka!A:I,872,8)","v":0},null,{"$f":"IF(INDEX(Objednavka!A:J,872,10)=\"\",\"\",INDEX(Objednavka!A:J,872,10))","v":""}]
[null,{"$f":"IF(INDEX(Objednavka!A:I,873,3)=\"\",INDEX(Objednavka!A:I,873,1),INDEX(Objednavka!A:I,873,3))","v":0},null,null,null,null,null,{"$f":"INDEX(Objednavka!A:I,873,4)","v":0},null,{"$f":"INDEX(Objednavka!A:I,873,5)","v":0},{"$f":"INDEX(Objednavka!A:I,873,7)","v":0},{"$f":"INDEX(Objednavka!A:I,873,8)","v":0},null,{"$f":"IF(INDEX(Objednavka!A:J,873,10)=\"\",\"\",INDEX(Objednavka!A:J,873,10))","v":""}]
[null,{"$f":"IF(INDEX(Objednavka!A:I,874,3)=\"\",INDEX(Objednavka!A:I,874,1),INDEX(Objednavka!A:I,874,3))","v":0},null,null,null,null,null,{"$f":"INDEX(Objednavka!A:I,874,4)","v":0},null,{"$f":"INDEX(Objednavka!A:I,874,5)","v":0},{"$f":"INDEX(Objednavka!A:I,874,7)","v":0},{"$f":"INDEX(Objednavka!A:I,874,8)","v":0},null,{"$f":"IF(INDEX(Objednavka!A:J,874,10)=\"\",\"\",INDEX(Objednavka!A:J,874,10))","v":""}]
[null,{"$f":"IF(INDEX(Objednavka!A:I,875,3)=\"\",INDEX(Objednavka!A:I,875,1),INDEX(Objednavka!A:I,875,3))","v":0},null,null,null,null,null,{"$f":"INDEX(Objednavka!A:I,875,4)","v":0},null,{"$f":"INDEX(Objednavka!A:I,875,5)","v":0},{"$f":"INDEX(Objednavka!A:I,875,7)","v":0},{"$f":"INDEX(Objednavka!A:I,875,8)","v":0},null,{"$f":"IF(INDEX(Objednavka!A:J,875,10)=\"\",\"\",INDEX(Objednavka!A:J,875,10))","v":""}]
[null,{"$f":"IF(INDEX(Objednavka!A:I,876,3)=\"\",INDEX(Objednavka!A:I,876,1),INDEX(Objednavka!A:I,876,3))","v":0},null,null,null,null,null,{"$f":"INDEX(Objednavka!A:I,876,4)","v":0},null,{"$f":"INDEX(Objednavka!A:I,876,5)","v":0},{"$f":"INDEX(Objednavka!A:I,876,7)","v":0},{"$f":"INDEX(Objednavka!A:I,876,8)","v":0},null,{"$f":"IF(INDEX(Objednavka!A:J,876,10)=\"\",\"\",INDEX(Objednavka!A:J,876,10))","v":""}]
[null,{"$f":"IF(INDEX(Objednavka!A:I,877,3)=\"\",INDEX(Objednavka!A:I,877,1),INDEX(Objednavka!A:I,877,3))","v":0},null,null,null,null,null,{"$f":"INDEX(Objednavka!A:I,877,4)","v":0},null,{"$f":"INDEX(Objednavka!A:I,877,5)","v":0},{"$f":"INDEX(Objednavka!A:I,877,7)","v":0},{"$f":"INDEX(Objednavka!A:I,877,8)","v":0},null,{"$f":"IF(INDEX(Objednavka!A:J,877,10)=\"\",\"\",INDEX(Objednavka!A:J,877,10))","v":""}]
[null,{"$f":"IF(INDEX(Objednavka!A:I,878,3)=\"\",INDEX(Objednavka!A:I,878,1),INDEX(Objednavka!A:I,878,3))","v":0},null,null,null,null,null,{"$f":"INDEX(Objednavka!A:I,878,4)","v":0},null,{"$f":"INDEX(Objednavka!A:I,878,5)","v":0},{"$f":"INDEX(Objednavka!A:I,878,7)","v":0},{"$f":"INDEX(Objednavka!A:I,878,8)","v":0},null,{"$f":"IF(INDEX(Objednavka!A:J,878,10)=\"\",\"\",INDEX(Objednavka!A:J,878,10))","v":""}]
[null,{"$f":"IF(INDEX(Objednavka!A:I,879,3)=\"\",INDEX(Objednavka!A:I,879,1),INDEX(Objednavka!A:I,879,3))","v":0},null,null,null,null,null,{"$f":"INDEX(Objednavka!A:I,879,4)","v":0},null,{"$f":"INDEX(Objednavka!A:I,879,5)","v":0},{"$f":"INDEX(Objednavka!A:I,879,7)","v":0},{"$f":"INDEX(Objednavka!A:I,879,8)","v":0},null,{"$f":"IF(INDEX(Objednavka!A:J,879,10)=\"\",\"\",INDEX(Objednavka!A:J,879,10))","v":""}]
[null,{"$f":"IF(INDEX(Objednavka!A:I,880,3)=\"\",INDEX(Objednavka!A:I,880,1),INDEX(Objednavka!A:I,880,3))","v":0},null,null,null,null,null,{"$f":"INDEX(Objednavka!A:I,880,4)","v":0},null,{"$f":"INDEX(Objednavka!A:I,880,5)","v":0},{"$f":"INDEX(Objednavka!A:I,880,7)","v":0},{"$f":"INDEX(Objednavka!A:I,880,8)","v":0},null,{"$f":"IF(INDEX(Objednavka!A:J,880,10)=\"\",\"\",INDEX(Objednavka!A:J,880,10))","v":""}]
[null,{"$f":"IF(INDEX(Objednavka!A:I,881,3)=\"\",INDEX(Objednavka!A:I,881,1),INDEX(Objednavka!A:I,881,3))","v":0},null,null,null,null,null,{"$f":"INDEX(Objednavka!A:I,881,4)","v":0},null,{"$f":"INDEX(Objednavka!A:I,881,5)","v":0},{"$f":"INDEX(Objednavka!A:I,881,7)","v":0},{"$f":"INDEX(Objednavka!A:I,881,8)","v":0},null,{"$f":"IF(INDEX(Objednavka!A:J,881,10)=\"\",\"\",INDEX(Objednavka!A:J,881,10))","v":""}]
[null,{"$f":"IF(INDEX(Objednavka!A:I,882,3)=\"\",INDEX(Objednavka!A:I,882,1),INDEX(Objednavka!A:I,882,3))","v":0},null,null,null,null,null,{"$f":"INDEX(Objednavka!A:I,882,4)","v":0},null,{"$f":"INDEX(Objednavka!A:I,882,5)","v":0},{"$f":"INDEX(Objednavka!A:I,882,7)","v":0},{"$f":"INDEX(Objednavka!A:I,882,8)","v":0},null,{"$f":"IF(INDEX(Objednavka!A:J,882,10)=\"\",\"\",INDEX(Objednavka!A:J,882,10))","v":""}]
[null,{"$f":"IF(INDEX(Objednavka!A:I,883,3)=\"\",INDEX(Objednavka!A:I,883,1),INDEX(Objednavka!A:I,883,3))","v":0},null,null,null,null,null,{"$f":"INDEX(Objednavka!A:I,883,4)","v":0},null,{"$f":"INDEX(Objednavka!A:I,883,5)","v":0},{"$f":"INDEX(Objednavka!A:I,883,7)","v":0},{"$f":"INDEX(Objednavka!A:I,883,8)","v":0},null,{"$f":"IF(INDEX(Objednavka!A:J,883,10)=\"\",\"\",INDEX(Objednavka!A:J,883,10))","v":""}]
[null,{"$f":"IF(INDEX(Objednavka!A:I,884,3)=\"\",INDEX(Objednavka!A:I,884,1),INDEX(Objednavka!A:I,884,3))","v":0},null,null,null,null,null,{"$f":"INDEX(Objednavka!A:I,884,4)","v":0},null,{"$f":"INDEX(Objednavka!A:I,884,5)","v":0},{"$f":"INDEX(Objednavka!A:I,884,7)","v":0},{"$f":"INDEX(Objednavka!A:I,884,8)","v":0},null,{"$f":"IF(INDEX(Objednavka!A:J,884,10)=\"\",\"\",INDEX(Objednavka!A:J,884,10))","v":""}]
[null,{"$f":"IF(INDEX(Objednavka!A:I,885,3)=\"\",INDEX(Objednavka!A:I,885,1),INDEX(Objednavka!A:I,885,3))","v":0},null,null,null,null,null,{"$f":"INDEX(Objednavka!A:I,885,4)","v":0},null,{"$f":"INDEX(Objednavka!A:I,885,5)","v":0},{"$f":"INDEX(Objednavka!A:I,885,7)","v":0},{"$f":"INDEX(Objednavka!A:I,885,8)","v":0},null,{"$f":"IF(INDEX(Objednavka!A:J,885,10)=\"\",\"\",INDEX(Objednavka!A:J,885,10))","v":""}]
[null,{"$f":"IF(INDEX(Objednavka!A:I,886,3)=\"\",INDEX(Objednavka!A:I,886,1),INDEX(Objednavka!A:I,886,3))","v":0},null,null,null,null,null,{"$f":"INDEX(Objednavka!A:I,886,4)","v":0},null,{"$f":"INDEX(Objednavka!A:I,886,5)","v":0},{"$f":"INDEX(Objednavka!A:I,886,7)","v":0},{"$f":"INDEX(Objednavka!A:I,886,8)","v":0},null,{"$f":"IF(INDEX(Objednavka!A:J,886,10)=\"\",\"\",INDEX(Objednavka!A:J,886,10))","v":""}]
[null,{"$f":"IF(INDEX(Objednavka!A:I,887,3)=\"\",INDEX(Objednavka!A:I,887,1),INDEX(Objednavka!A:I,887,3))","v":0},null,null,null,null,null,{"$f":"INDEX(Objednavka!A:I,887,4)","v":0},null,{"$f":"INDEX(Objednavka!A:I,887,5)","v":0},{"$f":"INDEX(Objednavka!A:I,887,7)","v":0},{"$f":"INDEX(Objednavka!A:I,887,8)","v":0},null,{"$f":"IF(INDEX(Objednavka!A:J,887,10)=\"\",\"\",INDEX(Objednavka!A:J,887,10))","v":""}]
[null,{"$f":"IF(INDEX(Objednavka!A:I,888,3)=\"\",INDEX(Objednavka!A:I,888,1),INDEX(Objednavka!A:I,888,3))","v":0},null,null,null,null,null,{"$f":"INDEX(Objednavka!A:I,888,4)","v":0},null,{"$f":"INDEX(Objednavka!A:I,888,5)","v":0},{"$f":"INDEX(Objednavka!A:I,888,7)","v":0},{"$f":"INDEX(Objednavka!A:I,888,8)","v":0},null,{"$f":"IF(INDEX(Objednavka!A:J,888,10)=\"\",\"\",INDEX(Objednavka!A:J,888,10))","v":""}]
[null,{"$f":"IF(INDEX(Objednavka!A:I,889,3)=\"\",INDEX(Objednavka!A:I,889,1),INDEX(Objednavka!A:I,889,3))","v":0},null,null,null,null,null,{"$f":"INDEX(Objednavka!A:I,889,4)","v":0},null,{"$f":"INDEX(Objednavka!A:I,889,5)","v":0},{"$f":"INDEX(Objednavka!A:I,889,7)","v":0},{"$f":"INDEX(Objednavka!A:I,889,8)","v":0},null,{"$f":"IF(INDEX(Objednavka!A:J,889,10)=\"\",\"\",INDEX(Objednavka!A:J,889,10))","v":""}]
[null,{"$f":"IF(INDEX(Objednavka!A:I,890,3)=\"\",INDEX(Objednavka!A:I,890,1),INDEX(Objednavka!A:I,890,3))","v":0},null,null,null,null,null,{"$f":"INDEX(Objednavka!A:I,890,4)","v":0},null,{"$f":"INDEX(Objednavka!A:I,890,5)","v":0},{"$f":"INDEX(Objednavka!A:I,890,7)","v":0},{"$f":"INDEX(Objednavka!A:I,890,8)","v":0},null,{"$f":"IF(INDEX(Objednavka!A:J,890,10)=\"\",\"\",INDEX(Objednavka!A:J,890,10))","v":""}]
[null,{"$f":"IF(INDEX(Objednavka!A:I,891,3)=\"\",INDEX(Objednavka!A:I,891,1),INDEX(Objednavka!A:I,891,3))","v":0},null,null,null,null,null,{"$f":"INDEX(Objednavka!A:I,891,4)","v":0},null,{"$f":"INDEX(Objednavka!A:I,891,5)","v":0},{"$f":"INDEX(Objednavka!A:I,891,7)","v":0},{"$f":"INDEX(Objednavka!A:I,891,8)","v":0},null,{"$f":"IF(INDEX(Objednavka!A:J,891,10)=\"\",\"\",INDEX(Objednavka!A:J,891,10))","v":""}]
[null,{"$f":"IF(INDEX(Objednavka!A:I,892,3)=\"\",INDEX(Objednavka!A:I,892,1),INDEX(Objednavka!A:I,892,3))","v":0},null,null,null,null,null,{"$f":"INDEX(Objednavka!A:I,892,4)","v":0},null,{"$f":"INDEX(Objednavka!A:I,892,5)","v":0},{"$f":"INDEX(Objednavka!A:I,892,7)","v":0},{"$f":"INDEX(Objednavka!A:I,892,8)","v":0},null,{"$f":"IF(INDEX(Objednavka!A:J,892,10)=\"\",\"\",INDEX(Objednavka!A:J,892,10))","v":""}]
[null,{"$f":"IF(INDEX(Objednavka!A:I,893,3)=\"\",INDEX(Objednavka!A:I,893,1),INDEX(Objednavka!A:I,893,3))","v":0},null,null,null,null,null,{"$f":"INDEX(Objednavka!A:I,893,4)","v":0},null,{"$f":"INDEX(Objednavka!A:I,893,5)","v":0},{"$f":"INDEX(Objednavka!A:I,893,7)","v":0},{"$f":"INDEX(Objednavka!A:I,893,8)","v":0},null,{"$f":"IF(INDEX(Objednavka!A:J,893,10)=\"\",\"\",INDEX(Objednavka!A:J,893,10))","v":""}]
[null,{"$f":"IF(INDEX(Objednavka!A:I,894,3)=\"\",INDEX(Objednavka!A:I,894,1),INDEX(Objednavka!A:I,894,3))","v":0},null,null,null,null,null,{"$f":"INDEX(Objednavka!A:I,894,4)","v":0},null,{"$f":"INDEX(Objednavka!A:I,894,5)","v":0},{"$f":"INDEX(Objednavka!A:I,894,7)","v":0},{"$f":"INDEX(Objednavka!A:I,894,8)","v":0},null,{"$f":"IF(INDEX(Objednavka!A:J,894,10)=\"\",\"\",INDEX(Objednavka!A:J,894,10))","v":""}]
[null,{"$f":"IF(INDEX(Objednavka!A:I,895,3)=\"\",INDEX(Objednavka!A:I,895,1),INDEX(Objednavka!A:I,895,3))","v":0},null,null,null,null,null,{"$f":"INDEX(Objednavka!A:I,895,4)","v":0},null,{"$f":"INDEX(Objednavka!A:I,895,5)","v":0},{"$f":"INDEX(Objednavka!A:I,895,7)","v":0},{"$f":"INDEX(Objednavka!A:I,895,8)","v":0},null,{"$f":"IF(INDEX(Objednavka!A:J,895,10)=\"\",\"\",INDEX(Objednavka!A:J,895,10))","v":""}]
[null,{"$f":"IF(INDEX(Objednavka!A:I,896,3)=\"\",INDEX(Objednavka!A:I,896,1),INDEX(Objednavka!A:I,896,3))","v":0},null,null,null,null,null,{"$f":"INDEX(Objednavka!A:I,896,4)","v":0},null,{"$f":"INDEX(Objednavka!A:I,896,5)","v":0},{"$f":"INDEX(Objednavka!A:I,896,7)","v":0},{"$f":"INDEX(Objednavka!A:I,896,8)","v":0},null,{"$f":"IF(INDEX(Objednavka!A:J,896,10)=\"\",\"\",INDEX(Objednavka!A:J,896,10))","v":""}]
[null,{"$f":"IF(INDEX(Objednavka!A:I,897,3)=\"\",INDEX(Objednavka!A:I,897,1),INDEX(Objednavka!A:I,897,3))","v":0},null,null,null,null,null,{"$f":"INDEX(Objednavka!A:I,897,4)","v":0},null,{"$f":"INDEX(Objednavka!A:I,897,5)","v":0},{"$f":"INDEX(Objednavka!A:I,897,7)","v":0},{"$f":"INDEX(Objednavka!A:I,897,8)","v":0},null,{"$f":"IF(INDEX(Objednavka!A:J,897,10)=\"\",\"\",INDEX(Objednavka!A:J,897,10))","v":""}]
[null,{"$f":"IF(INDEX(Objednavka!A:I,898,3)=\"\",INDEX(Objednavka!A:I,898,1),INDEX(Objednavka!A:I,898,3))","v":0},null,null,null,null,null,{"$f":"INDEX(Objednavka!A:I,898,4)","v":0},null,{"$f":"INDEX(Objednavka!A:I,898,5)","v":0},{"$f":"INDEX(Objednavka!A:I,898,7)","v":0},{"$f":"INDEX(Objednavka!A:I,898,8)","v":0},null,{"$f":"IF(INDEX(Objednavka!A:J,898,10)=\"\",\"\",INDEX(Objednavka!A:J,898,10))","v":""}]
[null,{"$f":"IF(INDEX(Objednavka!A:I,899,3)=\"\",INDEX(Objednavka!A:I,899,1),INDEX(Objednavka!A:I,899,3))","v":0},null,null,null,null,null,{"$f":"INDEX(Objednavka!A:I,899,4)","v":0},null,{"$f":"INDEX(Objednavka!A:I,899,5)","v":0},{"$f":"INDEX(Objednavka!A:I,899,7)","v":0},{"$f":"INDEX(Objednavka!A:I,899,8)","v":0},null,{"$f":"IF(INDEX(Objednavka!A:J,899,10)=\"\",\"\",INDEX(Objednavka!A:J,899,10))","v":""}]
[null,{"$f":"IF(INDEX(Objednavka!A:I,900,3)=\"\",INDEX(Objednavka!A:I,900,1),INDEX(Objednavka!A:I,900,3))","v":0},null,null,null,null,null,{"$f":"INDEX(Objednavka!A:I,900,4)","v":0},null,{"$f":"INDEX(Objednavka!A:I,900,5)","v":0},{"$f":"INDEX(Objednavka!A:I,900,7)","v":0},{"$f":"INDEX(Objednavka!A:I,900,8)","v":0},null,{"$f":"IF(INDEX(Objednavka!A:J,900,10)=\"\",\"\",INDEX(Objednavka!A:J,900,10))","v":""}]
[null,{"$f":"IF(INDEX(Objednavka!A:I,901,3)=\"\",INDEX(Objednavka!A:I,901,1),INDEX(Objednavka!A:I,901,3))","v":0},null,null,null,null,null,{"$f":"INDEX(Objednavka!A:I,901,4)","v":0},null,{"$f":"INDEX(Objednavka!A:I,901,5)","v":0},{"$f":"INDEX(Objednavka!A:I,901,7)","v":0},{"$f":"INDEX(Objednavka!A:I,901,8)","v":0},null,{"$f":"IF(INDEX(Objednavka!A:J,901,10)=\"\",\"\",INDEX(Objednavka!A:J,901,10))","v":""}]
[null,{"$f":"IF(INDEX(Objednavka!A:I,902,3)=\"\",INDEX(Objednavka!A:I,902,1),INDEX(Objednavka!A:I,902,3))","v":0},null,null,null,null,null,{"$f":"INDEX(Objednavka!A:I,902,4)","v":0},null,{"$f":"INDEX(Objednavka!A:I,902,5)","v":0},{"$f":"INDEX(Objednavka!A:I,902,7)","v":0},{"$f":"INDEX(Objednavka!A:I,902,8)","v":0},null,{"$f":"IF(INDEX(Objednavka!A:J,902,10)=\"\",\"\",INDEX(Objednavka!A:J,902,10))","v":""}]
[null,{"$f":"IF(INDEX(Objednavka!A:I,903,3)=\"\",INDEX(Objednavka!A:I,903,1),INDEX(Objednavka!A:I,903,3))","v":0},null,null,null,null,null,{"$f":"INDEX(Objednavka!A:I,903,4)","v":0},null,{"$f":"INDEX(Objednavka!A:I,903,5)","v":0},{"$f":"INDEX(Objednavka!A:I,903,7)","v":0},{"$f":"INDEX(Objednavka!A:I,903,8)","v":0},null,{"$f":"IF(INDEX(Objednavka!A:J,903,10)=\"\",\"\",INDEX(Objednavka!A:J,903,10))","v":""}]
[null,{"$f":"IF(INDEX(Objednavka!A:I,904,3)=\"\",INDEX(Objednavka!A:I,904,1),INDEX(Objednavka!A:I,904,3))","v":0},null,null,null,null,null,{"$f":"INDEX(Objednavka!A:I,904,4)","v":0},null,{"$f":"INDEX(Objednavka!A:I,904,5)","v":0},{"$f":"INDEX(Objednavka!A:I,904,7)","v":0},{"$f":"INDEX(Objednavka!A:I,904,8)","v":0},null,{"$f":"IF(INDEX(Objednavka!A:J,904,10)=\"\",\"\",INDEX(Objednavka!A:J,904,10))","v":""}]
[null,{"$f":"IF(INDEX(Objednavka!A:I,905,3)=\"\",INDEX(Objednavka!A:I,905,1),INDEX(Objednavka!A:I,905,3))","v":0},null,null,null,null,null,{"$f":"INDEX(Objednavka!A:I,905,4)","v":0},null,{"$f":"INDEX(Objednavka!A:I,905,5)","v":0},{"$f":"INDEX(Objednavka!A:I,905,7)","v":0},{"$f":"INDEX(Objednavka!A:I,905,8)","v":0},null,{"$f":"IF(INDEX(Objednavka!A:J,905,10)=\"\",\"\",INDEX(Objednavka!A:J,905,10))","v":""}]
[null,{"$f":"IF(INDEX(Objednavka!A:I,906,3)=\"\",INDEX(Objednavka!A:I,906,1),INDEX(Objednavka!A:I,906,3))","v":0},null,null,null,null,null,{"$f":"INDEX(Objednavka!A:I,906,4)","v":0},null,{"$f":"INDEX(Objednavka!A:I,906,5)","v":0},{"$f":"INDEX(Objednavka!A:I,906,7)","v":0},{"$f":"INDEX(Objednavka!A:I,906,8)","v":0},null,{"$f":"IF(INDEX(Objednavka!A:J,906,10)=\"\",\"\",INDEX(Objednavka!A:J,906,10))","v":""}]
[null,{"$f":"IF(INDEX(Objednavka!A:I,907,3)=\"\",INDEX(Objednavka!A:I,907,1),INDEX(Objednavka!A:I,907,3))","v":0},null,null,null,null,null,{"$f":"INDEX(Objednavka!A:I,907,4)","v":0},null,{"$f":"INDEX(Objednavka!A:I,907,5)","v":0},{"$f":"INDEX(Objednavka!A:I,907,7)","v":0},{"$f":"INDEX(Objednavka!A:I,907,8)","v":0},null,{"$f":"IF(INDEX(Objednavka!A:J,907,10)=\"\",\"\",INDEX(Objednavka!A:J,907,10))","v":""}]
[null,{"$f":"IF(INDEX(Objednavka!A:I,908,3)=\"\",INDEX(Objednavka!A:I,908,1),INDEX(Objednavka!A:I,908,3))","v":0},null,null,null,null,null,{"$f":"INDEX(Objednavka!A:I,908,4)","v":0},null,{"$f":"INDEX(Objednavka!A:I,908,5)","v":0},{"$f":"INDEX(Objednavka!A:I,908,7)","v":0},{"$f":"INDEX(Objednavka!A:I,908,8)","v":0},null,{"$f":"IF(INDEX(Objednavka!A:J,908,10)=\"\",\"\",INDEX(Objednavka!A:J,908,10))","v":""}]
[null,{"$f":"IF(INDEX(Objednavka!A:I,909,3)=\"\",INDEX(Objednavka!A:I,909,1),INDEX(Objednavka!A:I,909,3))","v":0},null,null,null,null,null,{"$f":"INDEX(Objednavka!A:I,909,4)","v":0},null,{"$f":"INDEX(Objednavka!A:I,909,5)","v":0},{"$f":"INDEX(Objednavka!A:I,909,7)","v":0},{"$f":"INDEX(Objednavka!A:I,909,8)","v":0},null,{"$f":"IF(INDEX(Objednavka!A:J,909,10)=\"\",\"\",INDEX(Objednavka!A:J,909,10))","v":""}]
[null,{"$f":"IF(INDEX(Objednavka!A:I,910,3)=\"\",INDEX(Objednavka!A:I,910,1),INDEX(Objednavka!A:I,910,3))","v":0},null,null,null,null,null,{"$f":"INDEX(Objednavka!A:I,910,4)","v":0},null,{"$f":"INDEX(Objednavka!A:I,910,5)","v":0},{"$f":"INDEX(Objednavka!A:I,910,7)","v":0},{"$f":"INDEX(Objednavka!A:I,910,8)","v":0},null,{"$f":"IF(INDEX(Objednavka!A:J,910,10)=\"\",\"\",INDEX(Objednavka!A:J,910,10))","v":""}]
[null,{"$f":"IF(INDEX(Objednavka!A:I,911,3)=\"\",INDEX(Objednavka!A:I,911,1),INDEX(Objednavka!A:I,911,3))","v":0},null,null,null,null,null,{"$f":"INDEX(Objednavka!A:I,911,4)","v":0},null,{"$f":"INDEX(Objednavka!A:I,911,5)","v":0},{"$f":"INDEX(Objednavka!A:I,911,7)","v":0},{"$f":"INDEX(Objednavka!A:I,911,8)","v":0},null,{"$f":"IF(INDEX(Objednavka!A:J,911,10)=\"\",\"\",INDEX(Objednavka!A:J,911,10))","v":""}]
[null,{"$f":"IF(INDEX(Objednavka!A:I,912,3)=\"\",INDEX(Objednavka!A:I,912,1),INDEX(Objednavka!A:I,912,3))","v":0},null,null,null,null,null,{"$f":"INDEX(Objednavka!A:I,912,4)","v":0},null,{"$f":"INDEX(Objednavka!A:I,912,5)","v":0},{"$f":"INDEX(Objednavka!A:I,912,7)","v":0},{"$f":"INDEX(Objednavka!A:I,912,8)","v":0},null,{"$f":"IF(INDEX(Objednavka!A:J,912,10)=\"\",\"\",INDEX(Objednavka!A:J,912,10))","v":""}]
[null,{"$f":"IF(INDEX(Objednavka!A:I,913,3)=\"\",INDEX(Objednavka!A:I,913,1),INDEX(Objednavka!A:I,913,3))","v":0},null,null,null,null,null,{"$f":"INDEX(Objednavka!A:I,913,4)","v":0},null,{"$f":"INDEX(Objednavka!A:I,913,5)","v":0},{"$f":"INDEX(Objednavka!A:I,913,7)","v":0},{"$f":"INDEX(Objednavka!A:I,913,8)","v":0},null,{"$f":"IF(INDEX(Objednavka!A:J,913,10)=\"\",\"\",INDEX(Objednavka!A:J,913,10))","v":""}]
[null,{"$f":"IF(INDEX(Objednavka!A:I,914,3)=\"\",INDEX(Objednavka!A:I,914,1),INDEX(Objednavka!A:I,914,3))","v":0},null,null,null,null,null,{"$f":"INDEX(Objednavka!A:I,914,4)","v":0},null,{"$f":"INDEX(Objednavka!A:I,914,5)","v":0},{"$f":"INDEX(Objednavka!A:I,914,7)","v":0},{"$f":"INDEX(Objednavka!A:I,914,8)","v":0},null,{"$f":"IF(INDEX(Objednavka!A:J,914,10)=\"\",\"\",INDEX(Objednavka!A:J,914,10))","v":""}]
[null,{"$f":"IF(INDEX(Objednavka!A:I,915,3)=\"\",INDEX(Objednavka!A:I,915,1),INDEX(Objednavka!A:I,915,3))","v":0},null,null,null,null,null,{"$f":"INDEX(Objednavka!A:I,915,4)","v":0},null,{"$f":"INDEX(Objednavka!A:I,915,5)","v":0},{"$f":"INDEX(Objednavka!A:I,915,7)","v":0},{"$f":"INDEX(Objednavka!A:I,915,8)","v":0},null,{"$f":"IF(INDEX(Objednavka!A:J,915,10)=\"\",\"\",INDEX(Objednavka!A:J,915,10))","v":""}]
[null,{"$f":"IF(INDEX(Objednavka!A:I,916,3)=\"\",INDEX(Objednavka!A:I,916,1),INDEX(Objednavka!A:I,916,3))","v":0},null,null,null,null,null,{"$f":"INDEX(Objednavka!A:I,916,4)","v":0},null,{"$f":"INDEX(Objednavka!A:I,916,5)","v":0},{"$f":"INDEX(Objednavka!A:I,916,7)","v":0},{"$f":"INDEX(Objednavka!A:I,916,8)","v":0},null,{"$f":"IF(INDEX(Objednavka!A:J,916,10)=\"\",\"\",INDEX(Objednavka!A:J,916,10))","v":""}]
[null,{"$f":"IF(INDEX(Objednavka!A:I,917,3)=\"\",INDEX(Objednavka!A:I,917,1),INDEX(Objednavka!A:I,917,3))","v":0},null,null,null,null,null,{"$f":"INDEX(Objednavka!A:I,917,4)","v":0},null,{"$f":"INDEX(Objednavka!A:I,917,5)","v":0},{"$f":"INDEX(Objednavka!A:I,917,7)","v":0},{"$f":"INDEX(Objednavka!A:I,917,8)","v":0},null,{"$f":"IF(INDEX(Objednavka!A:J,917,10)=\"\",\"\",INDEX(Objednavka!A:J,917,10))","v":""}]
[null,{"$f":"IF(INDEX(Objednavka!A:I,918,3)=\"\",INDEX(Objednavka!A:I,918,1),INDEX(Objednavka!A:I,918,3))","v":0},null,null,null,null,null,{"$f":"INDEX(Objednavka!A:I,918,4)","v":0},null,{"$f":"INDEX(Objednavka!A:I,918,5)","v":0},{"$f":"INDEX(Objednavka!A:I,918,7)","v":0},{"$f":"INDEX(Objednavka!A:I,918,8)","v":0},null,{"$f":"IF(INDEX(Objednavka!A:J,918,10)=\"\",\"\",INDEX(Objednavka!A:J,918,10))","v":""}]
[null,{"$f":"IF(INDEX(Objednavka!A:I,919,3)=\"\",INDEX(Objednavka!A:I,919,1),INDEX(Objednavka!A:I,919,3))","v":0},null,null,null,null,null,{"$f":"INDEX(Objednavka!A:I,919,4)","v":0},null,{"$f":"INDEX(Objednavka!A:I,919,5)","v":0},{"$f":"INDEX(Objednavka!A:I,919,7)","v":0},{"$f":"INDEX(Objednavka!A:I,919,8)","v":0},null,{"$f":"IF(INDEX(Objednavka!A:J,919,10)=\"\",\"\",INDEX(Objednavka!A:J,919,10))","v":""}]
[null,{"$f":"IF(INDEX(Objednavka!A:I,920,3)=\"\",INDEX(Objednavka!A:I,920,1),INDEX(Objednavka!A:I,920,3))","v":0},null,null,null,null,null,{"$f":"INDEX(Objednavka!A:I,920,4)","v":0},null,{"$f":"INDEX(Objednavka!A:I,920,5)","v":0},{"$f":"INDEX(Objednavka!A:I,920,7)","v":0},{"$f":"INDEX(Objednavka!A:I,920,8)","v":0},null,{"$f":"IF(INDEX(Objednavka!A:J,920,10)=\"\",\"\",INDEX(Objednavka!A:J,920,10))","v":""}]
[null,{"$f":"IF(INDEX(Objednavka!A:I,921,3)=\"\",INDEX(Objednavka!A:I,921,1),INDEX(Objednavka!A:I,921,3))","v":0},null,null,null,null,null,{"$f":"INDEX(Objednavka!A:I,921,4)","v":0},null,{"$f":"INDEX(Objednavka!A:I,921,5)","v":0},{"$f":"INDEX(Objednavka!A:I,921,7)","v":0},{"$f":"INDEX(Objednavka!A:I,921,8)","v":0},null,{"$f":"IF(INDEX(Objednavka!A:J,921,10)=\"\",\"\",INDEX(Objednavka!A:J,921,10))","v":""}]
[null,{"$f":"IF(INDEX(Objednavka!A:I,922,3)=\"\",INDEX(Objednavka!A:I,922,1),INDEX(Objednavka!A:I,922,3))","v":0},null,null,null,null,null,{"$f":"INDEX(Objednavka!A:I,922,4)","v":0},null,{"$f":"INDEX(Objednavka!A:I,922,5)","v":0},{"$f":"INDEX(Objednavka!A:I,922,7)","v":0},{"$f":"INDEX(Objednavka!A:I,922,8)","v":0},null,{"$f":"IF(INDEX(Objednavka!A:J,922,10)=\"\",\"\",INDEX(Objednavka!A:J,922,10))","v":""}]
[null,{"$f":"IF(INDEX(Objednavka!A:I,923,3)=\"\",INDEX(Objednavka!A:I,923,1),INDEX(Objednavka!A:I,923,3))","v":0},null,null,null,null,null,{"$f":"INDEX(Objednavka!A:I,923,4)","v":0},null,{"$f":"INDEX(Objednavka!A:I,923,5)","v":0},{"$f":"INDEX(Objednavka!A:I,923,7)","v":0},{"$f":"INDEX(Objednavka!A:I,923,8)","v":0},null,{"$f":"IF(INDEX(Objednavka!A:J,923,10)=\"\",\"\",INDEX(Objednavka!A:J,923,10))","v":""}]
[null,{"$f":"IF(INDEX(Objednavka!A:I,924,3)=\"\",INDEX(Objednavka!A:I,924,1),INDEX(Objednavka!A:I,924,3))","v":0},null,null,null,null,null,{"$f":"INDEX(Objednavka!A:I,924,4)","v":0},null,{"$f":"INDEX(Objednavka!A:I,924,5)","v":0},{"$f":"INDEX(Objednavka!A:I,924,7)","v":0},{"$f":"INDEX(Objednavka!A:I,924,8)","v":0},null,{"$f":"IF(INDEX(Objednavka!A:J,924,10)=\"\",\"\",INDEX(Objednavka!A:J,924,10))","v":""}]
[null,{"$f":"IF(INDEX(Objednavka!A:I,925,3)=\"\",INDEX(Objednavka!A:I,925,1),INDEX(Objednavka!A:I,925,3))","v":0},null,null,null,null,null,{"$f":"INDEX(Objednavka!A:I,925,4)","v":0},null,{"$f":"INDEX(Objednavka!A:I,925,5)","v":0},{"$f":"INDEX(Objednavka!A:I,925,7)","v":0},{"$f":"INDEX(Objednavka!A:I,925,8)","v":0},null,{"$f":"IF(INDEX(Objednavka!A:J,925,10)=\"\",\"\",INDEX(Objednavka!A:J,925,10))","v":""}]
[null,{"$f":"IF(INDEX(Objednavka!A:I,926,3)=\"\",INDEX(Objednavka!A:I,926,1),INDEX(Objednavka!A:I,926,3))","v":0},null,null,null,null,null,{"$f":"INDEX(Objednavka!A:I,926,4)","v":0},null,{"$f":"INDEX(Objednavka!A:I,926,5)","v":0},{"$f":"INDEX(Objednavka!A:I,926,7)","v":0},{"$f":"INDEX(Objednavka!A:I,926,8)","v":0},null,{"$f":"IF(INDEX(Objednavka!A:J,926,10)=\"\",\"\",INDEX(Objednavka!A:J,926,10))","v":""}]
[null,{"$f":"IF(INDEX(Objednavka!A:I,927,3)=\"\",INDEX(Objednavka!A:I,927,1),INDEX(Objednavka!A:I,927,3))","v":0},null,null,null,null,null,{"$f":"INDEX(Objednavka!A:I,927,4)","v":0},null,{"$f":"INDEX(Objednavka!A:I,927,5)","v":0},{"$f":"INDEX(Objednavka!A:I,927,7)","v":0},{"$f":"INDEX(Objednavka!A:I,927,8)","v":0},null,{"$f":"IF(INDEX(Objednavka!A:J,927,10)=\"\",\"\",INDEX(Objednavka!A:J,927,10))","v":""}]
[null,{"$f":"IF(INDEX(Objednavka!A:I,928,3)=\"\",INDEX(Objednavka!A:I,928,1),INDEX(Objednavka!A:I,928,3))","v":0},null,null,null,null,null,{"$f":"INDEX(Objednavka!A:I,928,4)","v":0},null,{"$f":"INDEX(Objednavka!A:I,928,5)","v":0},{"$f":"INDEX(Objednavka!A:I,928,7)","v":0},{"$f":"INDEX(Objednavka!A:I,928,8)","v":0},null,{"$f":"IF(INDEX(Objednavka!A:J,928,10)=\"\",\"\",INDEX(Objednavka!A:J,928,10))","v":""}]
[null,{"$f":"IF(INDEX(Objednavka!A:I,929,3)=\"\",INDEX(Objednavka!A:I,929,1),INDEX(Objednavka!A:I,929,3))","v":0},null,null,null,null,null,{"$f":"INDEX(Objednavka!A:I,929,4)","v":0},null,{"$f":"INDEX(Objednavka!A:I,929,5)","v":0},{"$f":"INDEX(Objednavka!A:I,929,7)","v":0},{"$f":"INDEX(Objednavka!A:I,929,8)","v":0},null,{"$f":"IF(INDEX(Objednavka!A:J,929,10)=\"\",\"\",INDEX(Objednavka!A:J,929,10))","v":""}]
[null,{"$f":"IF(INDEX(Objednavka!A:I,930,3)=\"\",INDEX(Objednavka!A:I,930,1),INDEX(Objednavka!A:I,930,3))","v":0},null,null,null,null,null,{"$f":"INDEX(Objednavka!A:I,930,4)","v":0},null,{"$f":"INDEX(Objednavka!A:I,930,5)","v":0},{"$f":"INDEX(Objednavka!A:I,930,7)","v":0},{"$f":"INDEX(Objednavka!A:I,930,8)","v":0},null,{"$f":"IF(INDEX(Objednavka!A:J,930,10)=\"\",\"\",INDEX(Objednavka!A:J,930,10))","v":""}]
[null,{"$f":"IF(INDEX(Objednavka!A:I,931,3)=\"\",INDEX(Objednavka!A:I,931,1),INDEX(Objednavka!A:I,931,3))","v":0},null,null,null,null,null,{"$f":"INDEX(Objednavka!A:I,931,4)","v":0},null,{"$f":"INDEX(Objednavka!A:I,931,5)","v":0},{"$f":"INDEX(Objednavka!A:I,931,7)","v":0},{"$f":"INDEX(Objednavka!A:I,931,8)","v":0},null,{"$f":"IF(INDEX(Objednavka!A:J,931,10)=\"\",\"\",INDEX(Objednavka!A:J,931,10))","v":""}]
[null,{"$f":"IF(INDEX(Objednavka!A:I,932,3)=\"\",INDEX(Objednavka!A:I,932,1),INDEX(Objednavka!A:I,932,3))","v":0},null,null,null,null,null,{"$f":"INDEX(Objednavka!A:I,932,4)","v":0},null,{"$f":"INDEX(Objednavka!A:I,932,5)","v":0},{"$f":"INDEX(Objednavka!A:I,932,7)","v":0},{"$f":"INDEX(Objednavka!A:I,932,8)","v":0},null,{"$f":"IF(INDEX(Objednavka!A:J,932,10)=\"\",\"\",INDEX(Objednavka!A:J,932,10))","v":""}]
[null,{"$f":"IF(INDEX(Objednavka!A:I,933,3)=\"\",INDEX(Objednavka!A:I,933,1),INDEX(Objednavka!A:I,933,3))","v":0},null,null,null,null,null,{"$f":"INDEX(Objednavka!A:I,933,4)","v":0},null,{"$f":"INDEX(Objednavka!A:I,933,5)","v":0},{"$f":"INDEX(Objednavka!A:I,933,7)","v":0},{"$f":"INDEX(Objednavka!A:I,933,8)","v":0},null,{"$f":"IF(INDEX(Objednavka!A:J,933,10)=\"\",\"\",INDEX(Objednavka!A:J,933,10))","v":""}]
[null,{"$f":"IF(INDEX(Objednavka!A:I,934,3)=\"\",INDEX(Objednavka!A:I,934,1),INDEX(Objednavka!A:I,934,3))","v":0},null,null,null,null,null,{"$f":"INDEX(Objednavka!A:I,934,4)","v":0},null,{"$f":"INDEX(Objednavka!A:I,934,5)","v":0},{"$f":"INDEX(Objednavka!A:I,934,7)","v":0},{"$f":"INDEX(Objednavka!A:I,934,8)","v":0},null,{"$f":"IF(INDEX(Objednavka!A:J,934,10)=\"\",\"\",INDEX(Objednavka!A:J,934,10))","v":""}]
[null,{"$f":"IF(INDEX(Objednavka!A:I,935,3)=\"\",INDEX(Objednavka!A:I,935,1),INDEX(Objednavka!A:I,935,3))","v":0},null,null,null,null,null,{"$f":"INDEX(Objednavka!A:I,935,4)","v":0},null,{"$f":"INDEX(Objednavka!A:I,935,5)","v":0},{"$f":"INDEX(Objednavka!A:I,935,7)","v":0},{"$f":"INDEX(Objednavka!A:I,935,8)","v":0},null,{"$f":"IF(INDEX(Objednavka!A:J,935,10)=\"\",\"\",INDEX(Objednavka!A:J,935,10))","v":""}]
[null,{"$f":"IF(INDEX(Objednavka!A:I,936,3)=\"\",INDEX(Objednavka!A:I,936,1),INDEX(Objednavka!A:I,936,3))","v":0},null,null,null,null,null,{"$f":"INDEX(Objednavka!A:I,936,4)","v":0},null,{"$f":"INDEX(Objednavka!A:I,936,5)","v":0},{"$f":"INDEX(Objednavka!A:I,936,7)","v":0},{"$f":"INDEX(Objednavka!A:I,936,8)","v":0},null,{"$f":"IF(INDEX(Objednavka!A:J,936,10)=\"\",\"\",INDEX(Objednavka!A:J,936,10))","v":""}]
[null,{"$f":"IF(INDEX(Objednavka!A:I,937,3)=\"\",INDEX(Objednavka!A:I,937,1),INDEX(Objednavka!A:I,937,3))","v":0},null,null,null,null,null,{"$f":"INDEX(Objednavka!A:I,937,4)","v":0},null,{"$f":"INDEX(Objednavka!A:I,937,5)","v":0},{"$f":"INDEX(Objednavka!A:I,937,7)","v":0},{"$f":"INDEX(Objednavka!A:I,937,8)","v":0},null,{"$f":"IF(INDEX(Objednavka!A:J,937,10)=\"\",\"\",INDEX(Objednavka!A:J,937,10))","v":""}]
[null,{"$f":"IF(INDEX(Objednavka!A:I,938,3)=\"\",INDEX(Objednavka!A:I,938,1),INDEX(Objednavka!A:I,938,3))","v":0},null,null,null,null,null,{"$f":"INDEX(Objednavka!A:I,938,4)","v":0},null,{"$f":"INDEX(Objednavka!A:I,938,5)","v":0},{"$f":"INDEX(Objednavka!A:I,938,7)","v":0},{"$f":"INDEX(Objednavka!A:I,938,8)","v":0},null,{"$f":"IF(INDEX(Objednavka!A:J,938,10)=\"\",\"\",INDEX(Objednavka!A:J,938,10))","v":""}]
[null,{"$f":"IF(INDEX(Objednavka!A:I,939,3)=\"\",INDEX(Objednavka!A:I,939,1),INDEX(Objednavka!A:I,939,3))","v":0},null,null,null,null,null,{"$f":"INDEX(Objednavka!A:I,939,4)","v":0},null,{"$f":"INDEX(Objednavka!A:I,939,5)","v":0},{"$f":"INDEX(Objednavka!A:I,939,7)","v":0},{"$f":"INDEX(Objednavka!A:I,939,8)","v":0},null,{"$f":"IF(INDEX(Objednavka!A:J,939,10)=\"\",\"\",INDEX(Objednavka!A:J,939,10))","v":""}]
[null,{"$f":"IF(INDEX(Objednavka!A:I,940,3)=\"\",INDEX(Objednavka!A:I,940,1),INDEX(Objednavka!A:I,940,3))","v":0},null,null,null,null,null,{"$f":"INDEX(Objednavka!A:I,940,4)","v":0},null,{"$f":"INDEX(Objednavka!A:I,940,5)","v":0},{"$f":"INDEX(Objednavka!A:I,940,7)","v":0},{"$f":"INDEX(Objednavka!A:I,940,8)","v":0},null,{"$f":"IF(INDEX(Objednavka!A:J,940,10)=\"\",\"\",INDEX(Objednavka!A:J,940,10))","v":""}]
[null,{"$f":"IF(INDEX(Objednavka!A:I,941,3)=\"\",INDEX(Objednavka!A:I,941,1),INDEX(Objednavka!A:I,941,3))","v":0},null,null,null,null,null,{"$f":"INDEX(Objednavka!A:I,941,4)","v":0},null,{"$f":"INDEX(Objednavka!A:I,941,5)","v":0},{"$f":"INDEX(Objednavka!A:I,941,7)","v":0},{"$f":"INDEX(Objednavka!A:I,941,8)","v":0},null,{"$f":"IF(INDEX(Objednavka!A:J,941,10)=\"\",\"\",INDEX(Objednavka!A:J,941,10))","v":""}]
[null,{"$f":"IF(INDEX(Objednavka!A:I,942,3)=\"\",INDEX(Objednavka!A:I,942,1),INDEX(Objednavka!A:I,942,3))","v":0},null,null,null,null,null,{"$f":"INDEX(Objednavka!A:I,942,4)","v":0},null,{"$f":"INDEX(Objednavka!A:I,942,5)","v":0},{"$f":"INDEX(Objednavka!A:I,942,7)","v":0},{"$f":"INDEX(Objednavka!A:I,942,8)","v":0},null,{"$f":"IF(INDEX(Objednavka!A:J,942,10)=\"\",\"\",INDEX(Objednavka!A:J,942,10))","v":""}]
[null,{"$f":"IF(INDEX(Objednavka!A:I,943,3)=\"\",INDEX(Objednavka!A:I,943,1),INDEX(Objednavka!A:I,943,3))","v":0},null,null,null,null,null,{"$f":"INDEX(Objednavka!A:I,943,4)","v":0},null,{"$f":"INDEX(Objednavka!A:I,943,5)","v":0},{"$f":"INDEX(Objednavka!A:I,943,7)","v":0},{"$f":"INDEX(Objednavka!A:I,943,8)","v":0},null,{"$f":"IF(INDEX(Objednavka!A:J,943,10)=\"\",\"\",INDEX(Objednavka!A:J,943,10))","v":""}]
[null,{"$f":"IF(INDEX(Objednavka!A:I,944,3)=\"\",INDEX(Objednavka!A:I,944,1),INDEX(Objednavka!A:I,944,3))","v":0},null,null,null,null,null,{"$f":"INDEX(Objednavka!A:I,944,4)","v":0},null,{"$f":"INDEX(Objednavka!A:I,944,5)","v":0},{"$f":"INDEX(Objednavka!A:I,944,7)","v":0},{"$f":"INDEX(Objednavka!A:I,944,8)","v":0},null,{"$f":"IF(INDEX(Objednavka!A:J,944,10)=\"\",\"\",INDEX(Objednavka!A:J,944,10))","v":""}]
[null,{"$f":"IF(INDEX(Objednavka!A:I,945,3)=\"\",INDEX(Objednavka!A:I,945,1),INDEX(Objednavka!A:I,945,3))","v":0},null,null,null,null,null,{"$f":"INDEX(Objednavka!A:I,945,4)","v":0},null,{"$f":"INDEX(Objednavka!A:I,945,5)","v":0},{"$f":"INDEX(Objednavka!A:I,945,7)","v":0},{"$f":"INDEX(Objednavka!A:I,945,8)","v":0},null,{"$f":"IF(INDEX(Objednavka!A:J,945,10)=\"\",\"\",INDEX(Objednavka!A:J,945,10))","v":""}]
[null,{"$f":"IF(INDEX(Objednavka!A:I,946,3)=\"\",INDEX(Objednavka!A:I,946,1),INDEX(Objednavka!A:I,946,3))","v":0},null,null,null,null,null,{"$f":"INDEX(Objednavka!A:I,946,4)","v":0},null,{"$f":"INDEX(Objednavka!A:I,946,5)","v":0},{"$f":"INDEX(Objednavka!A:I,946,7)","v":0},{"$f":"INDEX(Objednavka!A:I,946,8)","v":0},null,{"$f":"IF(INDEX(Objednavka!A:J,946,10)=\"\",\"\",INDEX(Objednavka!A:J,946,10))","v":""}]
[null,{"$f":"IF(INDEX(Objednavka!A:I,947,3)=\"\",INDEX(Objednavka!A:I,947,1),INDEX(Objednavka!A:I,947,3))","v":0},null,null,null,null,null,{"$f":"INDEX(Objednavka!A:I,947,4)","v":0},null,{"$f":"INDEX(Objednavka!A:I,947,5)","v":0},{"$f":"INDEX(Objednavka!A:I,947,7)","v":0},{"$f":"INDEX(Objednavka!A:I,947,8)","v":0},null,{"$f":"IF(INDEX(Objednavka!A:J,947,10)=\"\",\"\",INDEX(Objednavka!A:J,947,10))","v":""}]
[null,{"$f":"IF(INDEX(Objednavka!A:I,948,3)=\"\",INDEX(Objednavka!A:I,948,1),INDEX(Objednavka!A:I,948,3))","v":0},null,null,null,null,null,{"$f":"INDEX(Objednavka!A:I,948,4)","v":0},null,{"$f":"INDEX(Objednavka!A:I,948,5)","v":0},{"$f":"INDEX(Objednavka!A:I,948,7)","v":0},{"$f":"INDEX(Objednavka!A:I,948,8)","v":0},null,{"$f":"IF(INDEX(Objednavka!A:J,948,10)=\"\",\"\",INDEX(Objednavka!A:J,948,10))","v":""}]
[null,{"$f":"IF(INDEX(Objednavka!A:I,949,3)=\"\",INDEX(Objednavka!A:I,949,1),INDEX(Objednavka!A:I,949,3))","v":0},null,null,null,null,null,{"$f":"INDEX(Objednavka!A:I,949,4)","v":0},null,{"$f":"INDEX(Objednavka!A:I,949,5)","v":0},{"$f":"INDEX(Objednavka!A:I,949,7)","v":0},{"$f":"INDEX(Objednavka!A:I,949,8)","v":0},null,{"$f":"IF(INDEX(Objednavka!A:J,949,10)=\"\",\"\",INDEX(Objednavka!A:J,949,10))","v":""}]
[null,{"$f":"IF(INDEX(Objednavka!A:I,950,3)=\"\",INDEX(Objednavka!A:I,950,1),INDEX(Objednavka!A:I,950,3))","v":0},null,null,null,null,null,{"$f":"INDEX(Objednavka!A:I,950,4)","v":0},null,{"$f":"INDEX(Objednavka!A:I,950,5)","v":0},{"$f":"INDEX(Objednavka!A:I,950,7)","v":0},{"$f":"INDEX(Objednavka!A:I,950,8)","v":0},null,{"$f":"IF(INDEX(Objednavka!A:J,950,10)=\"\",\"\",INDEX(Objednavka!A:J,950,10))","v":""}]
[null,{"$f":"IF(INDEX(Objednavka!A:I,951,3)=\"\",INDEX(Objednavka!A:I,951,1),INDEX(Objednavka!A:I,951,3))","v":0},null,null,null,null,null,{"$f":"INDEX(Objednavka!A:I,951,4)","v":0},null,{"$f":"INDEX(Objednavka!A:I,951,5)","v":0},{"$f":"INDEX(Objednavka!A:I,951,7)","v":0},{"$f":"INDEX(Objednavka!A:I,951,8)","v":0},null,{"$f":"IF(INDEX(Objednavka!A:J,951,10)=\"\",\"\",INDEX(Objednavka!A:J,951,10))","v":""}]
[null,{"$f":"IF(INDEX(Objednavka!A:I,952,3)=\"\",INDEX(Objednavka!A:I,952,1),INDEX(Objednavka!A:I,952,3))","v":0},null,null,null,null,null,{"$f":"INDEX(Objednavka!A:I,952,4)","v":0},null,{"$f":"INDEX(Objednavka!A:I,952,5)","v":0},{"$f":"INDEX(Objednavka!A:I,952,7)","v":0},{"$f":"INDEX(Objednavka!A:I,952,8)","v":0},null,{"$f":"IF(INDEX(Objednavka!A:J,952,10)=\"\",\"\",INDEX(Objednavka!A:J,952,10))","v":""}]
[null,{"$f":"IF(INDEX(Objednavka!A:I,953,3)=\"\",INDEX(Objednavka!A:I,953,1),INDEX(Objednavka!A:I,953,3))","v":0},null,null,null,null,null,{"$f":"INDEX(Objednavka!A:I,953,4)","v":0},null,{"$f":"INDEX(Objednavka!A:I,953,5)","v":0},{"$f":"INDEX(Objednavka!A:I,953,7)","v":0},{"$f":"INDEX(Objednavka!A:I,953,8)","v":0},null,{"$f":"IF(INDEX(Objednavka!A:J,953,10)=\"\",\"\",INDEX(Objednavka!A:J,953,10))","v":""}]
[null,{"$f":"IF(INDEX(Objednavka!A:I,954,3)=\"\",INDEX(Objednavka!A:I,954,1),INDEX(Objednavka!A:I,954,3))","v":0},null,null,null,null,null,{"$f":"INDEX(Objednavka!A:I,954,4)","v":0},null,{"$f":"INDEX(Objednavka!A:I,954,5)","v":0},{"$f":"INDEX(Objednavka!A:I,954,7)","v":0},{"$f":"INDEX(Objednavka!A:I,954,8)","v":0},null,{"$f":"IF(INDEX(Objednavka!A:J,954,10)=\"\",\"\",INDEX(Objednavka!A:J,954,10))","v":""}]
[null,{"$f":"IF(INDEX(Objednavka!A:I,955,3)=\"\",INDEX(Objednavka!A:I,955,1),INDEX(Objednavka!A:I,955,3))","v":0},null,null,null,null,null,{"$f":"INDEX(Objednavka!A:I,955,4)","v":0},null,{"$f":"INDEX(Objednavka!A:I,955,5)","v":0},{"$f":"INDEX(Objednavka!A:I,955,7)","v":0},{"$f":"INDEX(Objednavka!A:I,955,8)","v":0},null,{"$f":"IF(INDEX(Objednavka!A:J,955,10)=\"\",\"\",INDEX(Objednavka!A:J,955,10))","v":""}]
[null,{"$f":"IF(INDEX(Objednavka!A:I,956,3)=\"\",INDEX(Objednavka!A:I,956,1),INDEX(Objednavka!A:I,956,3))","v":0},null,null,null,null,null,{"$f":"INDEX(Objednavka!A:I,956,4)","v":0},null,{"$f":"INDEX(Objednavka!A:I,956,5)","v":0},{"$f":"INDEX(Objednavka!A:I,956,7)","v":0},{"$f":"INDEX(Objednavka!A:I,956,8)","v":0},null,{"$f":"IF(INDEX(Objednavka!A:J,956,10)=\"\",\"\",INDEX(Objednavka!A:J,956,10))","v":""}]
[null,{"$f":"IF(INDEX(Objednavka!A:I,957,3)=\"\",INDEX(Objednavka!A:I,957,1),INDEX(Objednavka!A:I,957,3))","v":0},null,null,null,null,null,{"$f":"INDEX(Objednavka!A:I,957,4)","v":0},null,{"$f":"INDEX(Objednavka!A:I,957,5)","v":0},{"$f":"INDEX(Objednavka!A:I,957,7)","v":0},{"$f":"INDEX(Objednavka!A:I,957,8)","v":0},null,{"$f":"IF(INDEX(Objednavka!A:J,957,10)=\"\",\"\",INDEX(Objednavka!A:J,957,10))","v":""}]
[null,{"$f":"IF(INDEX(Objednavka!A:I,958,3)=\"\",INDEX(Objednavka!A:I,958,1),INDEX(Objednavka!A:I,958,3))","v":0},null,null,null,null,null,{"$f":"INDEX(Objednavka!A:I,958,4)","v":0},null,{"$f":"INDEX(Objednavka!A:I,958,5)","v":0},{"$f":"INDEX(Objednavka!A:I,958,7)","v":0},{"$f":"INDEX(Objednavka!A:I,958,8)","v":0},null,{"$f":"IF(INDEX(Objednavka!A:J,958,10)=\"\",\"\",INDEX(Objednavka!A:J,958,10))","v":""}]
[null,{"$f":"IF(INDEX(Objednavka!A:I,959,3)=\"\",INDEX(Objednavka!A:I,959,1),INDEX(Objednavka!A:I,959,3))","v":0},null,null,null,null,null,{"$f":"INDEX(Objednavka!A:I,959,4)","v":0},null,{"$f":"INDEX(Objednavka!A:I,959,5)","v":0},{"$f":"INDEX(Objednavka!A:I,959,7)","v":0},{"$f":"INDEX(Objednavka!A:I,959,8)","v":0},null,{"$f":"IF(INDEX(Objednavka!A:J,959,10)=\"\",\"\",INDEX(Objednavka!A:J,959,10))","v":""}]
[null,{"$f":"IF(INDEX(Objednavka!A:I,960,3)=\"\",INDEX(Objednavka!A:I,960,1),INDEX(Objednavka!A:I,960,3))","v":0},null,null,null,null,null,{"$f":"INDEX(Objednavka!A:I,960,4)","v":0},null,{"$f":"INDEX(Objednavka!A:I,960,5)","v":0},{"$f":"INDEX(Objednavka!A:I,960,7)","v":0},{"$f":"INDEX(Objednavka!A:I,960,8)","v":0},null,{"$f":"IF(INDEX(Objednavka!A:J,960,10)=\"\",\"\",INDEX(Objednavka!A:J,960,10))","v":""}]
[null,{"$f":"IF(INDEX(Objednavka!A:I,961,3)=\"\",INDEX(Objednavka!A:I,961,1),INDEX(Objednavka!A:I,961,3))","v":0},null,null,null,null,null,{"$f":"INDEX(Objednavka!A:I,961,4)","v":0},null,{"$f":"INDEX(Objednavka!A:I,961,5)","v":0},{"$f":"INDEX(Objednavka!A:I,961,7)","v":0},{"$f":"INDEX(Objednavka!A:I,961,8)","v":0},null,{"$f":"IF(INDEX(Objednavka!A:J,961,10)=\"\",\"\",INDEX(Objednavka!A:J,961,10))","v":""}]
[null,{"$f":"IF(INDEX(Objednavka!A:I,962,3)=\"\",INDEX(Objednavka!A:I,962,1),INDEX(Objednavka!A:I,962,3))","v":0},null,null,null,null,null,{"$f":"INDEX(Objednavka!A:I,962,4)","v":0},null,{"$f":"INDEX(Objednavka!A:I,962,5)","v":0},{"$f":"INDEX(Objednavka!A:I,962,7)","v":0},{"$f":"INDEX(Objednavka!A:I,962,8)","v":0},null,{"$f":"IF(INDEX(Objednavka!A:J,962,10)=\"\",\"\",INDEX(Objednavka!A:J,962,10))","v":""}]
[null,{"$f":"IF(INDEX(Objednavka!A:I,963,3)=\"\",INDEX(Objednavka!A:I,963,1),INDEX(Objednavka!A:I,963,3))","v":0},null,null,null,null,null,{"$f":"INDEX(Objednavka!A:I,963,4)","v":0},null,{"$f":"INDEX(Objednavka!A:I,963,5)","v":0},{"$f":"INDEX(Objednavka!A:I,963,7)","v":0},{"$f":"INDEX(Objednavka!A:I,963,8)","v":0},null,{"$f":"IF(INDEX(Objednavka!A:J,963,10)=\"\",\"\",INDEX(Objednavka!A:J,963,10))","v":""}]
[null,{"$f":"IF(INDEX(Objednavka!A:I,964,3)=\"\",INDEX(Objednavka!A:I,964,1),INDEX(Objednavka!A:I,964,3))","v":0},null,null,null,null,null,{"$f":"INDEX(Objednavka!A:I,964,4)","v":0},null,{"$f":"INDEX(Objednavka!A:I,964,5)","v":0},{"$f":"INDEX(Objednavka!A:I,964,7)","v":0},{"$f":"INDEX(Objednavka!A:I,964,8)","v":0},null,{"$f":"IF(INDEX(Objednavka!A:J,964,10)=\"\",\"\",INDEX(Objednavka!A:J,964,10))","v":""}]
[null,{"$f":"IF(INDEX(Objednavka!A:I,965,3)=\"\",INDEX(Objednavka!A:I,965,1),INDEX(Objednavka!A:I,965,3))","v":0},null,null,null,null,null,{"$f":"INDEX(Objednavka!A:I,965,4)","v":0},null,{"$f":"INDEX(Objednavka!A:I,965,5)","v":0},{"$f":"INDEX(Objednavka!A:I,965,7)","v":0},{"$f":"INDEX(Objednavka!A:I,965,8)","v":0},null,{"$f":"IF(INDEX(Objednavka!A:J,965,10)=\"\",\"\",INDEX(Objednavka!A:J,965,10))","v":""}]
[null,{"$f":"IF(INDEX(Objednavka!A:I,966,3)=\"\",INDEX(Objednavka!A:I,966,1),INDEX(Objednavka!A:I,966,3))","v":0},null,null,null,null,null,{"$f":"INDEX(Objednavka!A:I,966,4)","v":0},null,{"$f":"INDEX(Objednavka!A:I,966,5)","v":0},{"$f":"INDEX(Objednavka!A:I,966,7)","v":0},{"$f":"INDEX(Objednavka!A:I,966,8)","v":0},null,{"$f":"IF(INDEX(Objednavka!A:J,966,10)=\"\",\"\",INDEX(Objednavka!A:J,966,10))","v":""}]
[null,{"$f":"IF(INDEX(Objednavka!A:I,967,3)=\"\",INDEX(Objednavka!A:I,967,1),INDEX(Objednavka!A:I,967,3))","v":0},null,null,null,null,null,{"$f":"INDEX(Objednavka!A:I,967,4)","v":0},null,{"$f":"INDEX(Objednavka!A:I,967,5)","v":0},{"$f":"INDEX(Objednavka!A:I,967,7)","v":0},{"$f":"INDEX(Objednavka!A:I,967,8)","v":0},null,{"$f":"IF(INDEX(Objednavka!A:J,967,10)=\"\",\"\",INDEX(Objednavka!A:J,967,10))","v":""}]
[null,{"$f":"IF(INDEX(Objednavka!A:I,968,3)=\"\",INDEX(Objednavka!A:I,968,1),INDEX(Objednavka!A:I,968,3))","v":0},null,null,null,null,null,{"$f":"INDEX(Objednavka!A:I,968,4)","v":0},null,{"$f":"INDEX(Objednavka!A:I,968,5)","v":0},{"$f":"INDEX(Objednavka!A:I,968,7)","v":0},{"$f":"INDEX(Objednavka!A:I,968,8)","v":0},null,{"$f":"IF(INDEX(Objednavka!A:J,968,10)=\"\",\"\",INDEX(Objednavka!A:J,968,10))","v":""}]
[null,{"$f":"IF(INDEX(Objednavka!A:I,969,3)=\"\",INDEX(Objednavka!A:I,969,1),INDEX(Objednavka!A:I,969,3))","v":0},null,null,null,null,null,{"$f":"INDEX(Objednavka!A:I,969,4)","v":0},null,{"$f":"INDEX(Objednavka!A:I,969,5)","v":0},{"$f":"INDEX(Objednavka!A:I,969,7)","v":0},{"$f":"INDEX(Objednavka!A:I,969,8)","v":0},null,{"$f":"IF(INDEX(Objednavka!A:J,969,10)=\"\",\"\",INDEX(Objednavka!A:J,969,10))","v":""}]
[null,{"$f":"IF(INDEX(Objednavka!A:I,970,3)=\"\",INDEX(Objednavka!A:I,970,1),INDEX(Objednavka!A:I,970,3))","v":0},null,null,null,null,null,{"$f":"INDEX(Objednavka!A:I,970,4)","v":0},null,{"$f":"INDEX(Objednavka!A:I,970,5)","v":0},{"$f":"INDEX(Objednavka!A:I,970,7)","v":0},{"$f":"INDEX(Objednavka!A:I,970,8)","v":0},null,{"$f":"IF(INDEX(Objednavka!A:J,970,10)=\"\",\"\",INDEX(Objednavka!A:J,970,10))","v":""}]
[null,{"$f":"IF(INDEX(Objednavka!A:I,971,3)=\"\",INDEX(Objednavka!A:I,971,1),INDEX(Objednavka!A:I,971,3))","v":0},null,null,null,null,null,{"$f":"INDEX(Objednavka!A:I,971,4)","v":0},null,{"$f":"INDEX(Objednavka!A:I,971,5)","v":0},{"$f":"INDEX(Objednavka!A:I,971,7)","v":0},{"$f":"INDEX(Objednavka!A:I,971,8)","v":0},null,{"$f":"IF(INDEX(Objednavka!A:J,971,10)=\"\",\"\",INDEX(Objednavka!A:J,971,10))","v":""}]
[null,{"$f":"IF(INDEX(Objednavka!A:I,972,3)=\"\",INDEX(Objednavka!A:I,972,1),INDEX(Objednavka!A:I,972,3))","v":0},null,null,null,null,null,{"$f":"INDEX(Objednavka!A:I,972,4)","v":0},null,{"$f":"INDEX(Objednavka!A:I,972,5)","v":0},{"$f":"INDEX(Objednavka!A:I,972,7)","v":0},{"$f":"INDEX(Objednavka!A:I,972,8)","v":0},null,{"$f":"IF(INDEX(Objednavka!A:J,972,10)=\"\",\"\",INDEX(Objednavka!A:J,972,10))","v":""}]
[null,{"$f":"IF(INDEX(Objednavka!A:I,973,3)=\"\",INDEX(Objednavka!A:I,973,1),INDEX(Objednavka!A:I,973,3))","v":0},null,null,null,null,null,{"$f":"INDEX(Objednavka!A:I,973,4)","v":0},null,{"$f":"INDEX(Objednavka!A:I,973,5)","v":0},{"$f":"INDEX(Objednavka!A:I,973,7)","v":0},{"$f":"INDEX(Objednavka!A:I,973,8)","v":0},null,{"$f":"IF(INDEX(Objednavka!A:J,973,10)=\"\",\"\",INDEX(Objednavka!A:J,973,10))","v":""}]
[null,{"$f":"IF(INDEX(Objednavka!A:I,974,3)=\"\",INDEX(Objednavka!A:I,974,1),INDEX(Objednavka!A:I,974,3))","v":0},null,null,null,null,null,{"$f":"INDEX(Objednavka!A:I,974,4)","v":0},null,{"$f":"INDEX(Objednavka!A:I,974,5)","v":0},{"$f":"INDEX(Objednavka!A:I,974,7)","v":0},{"$f":"INDEX(Objednavka!A:I,974,8)","v":0},null,{"$f":"IF(INDEX(Objednavka!A:J,974,10)=\"\",\"\",INDEX(Objednavka!A:J,974,10))","v":""}]
[null,{"$f":"IF(INDEX(Objednavka!A:I,975,3)=\"\",INDEX(Objednavka!A:I,975,1),INDEX(Objednavka!A:I,975,3))","v":0},null,null,null,null,null,{"$f":"INDEX(Objednavka!A:I,975,4)","v":0},null,{"$f":"INDEX(Objednavka!A:I,975,5)","v":0},{"$f":"INDEX(Objednavka!A:I,975,7)","v":0},{"$f":"INDEX(Objednavka!A:I,975,8)","v":0},null,{"$f":"IF(INDEX(Objednavka!A:J,975,10)=\"\",\"\",INDEX(Objednavka!A:J,975,10))","v":""}]
[null,{"$f":"IF(INDEX(Objednavka!A:I,976,3)=\"\",INDEX(Objednavka!A:I,976,1),INDEX(Objednavka!A:I,976,3))","v":0},null,null,null,null,null,{"$f":"INDEX(Objednavka!A:I,976,4)","v":0},null,{"$f":"INDEX(Objednavka!A:I,976,5)","v":0},{"$f":"INDEX(Objednavka!A:I,976,7)","v":0},{"$f":"INDEX(Objednavka!A:I,976,8)","v":0},null,{"$f":"IF(INDEX(Objednavka!A:J,976,10)=\"\",\"\",INDEX(Objednavka!A:J,976,10))","v":""}]
[null,{"$f":"IF(INDEX(Objednavka!A:I,977,3)=\"\",INDEX(Objednavka!A:I,977,1),INDEX(Objednavka!A:I,977,3))","v":0},null,null,null,null,null,{"$f":"INDEX(Objednavka!A:I,977,4)","v":0},null,{"$f":"INDEX(Objednavka!A:I,977,5)","v":0},{"$f":"INDEX(Objednavka!A:I,977,7)","v":0},{"$f":"INDEX(Objednavka!A:I,977,8)","v":0},null,{"$f":"IF(INDEX(Objednavka!A:J,977,10)=\"\",\"\",INDEX(Objednavka!A:J,977,10))","v":""}]
[null,{"$f":"IF(INDEX(Objednavka!A:I,978,3)=\"\",INDEX(Objednavka!A:I,978,1),INDEX(Objednavka!A:I,978,3))","v":0},null,null,null,null,null,{"$f":"INDEX(Objednavka!A:I,978,4)","v":0},null,{"$f":"INDEX(Objednavka!A:I,978,5)","v":0},{"$f":"INDEX(Objednavka!A:I,978,7)","v":0},{"$f":"INDEX(Objednavka!A:I,978,8)","v":0},null,{"$f":"IF(INDEX(Objednavka!A:J,978,10)=\"\",\"\",INDEX(Objednavka!A:J,978,10))","v":""}]
[null,{"$f":"IF(INDEX(Objednavka!A:I,979,3)=\"\",INDEX(Objednavka!A:I,979,1),INDEX(Objednavka!A:I,979,3))","v":0},null,null,null,null,null,{"$f":"INDEX(Objednavka!A:I,979,4)","v":0},null,{"$f":"INDEX(Objednavka!A:I,979,5)","v":0},{"$f":"INDEX(Objednavka!A:I,979,7)","v":0},{"$f":"INDEX(Objednavka!A:I,979,8)","v":0},null,{"$f":"IF(INDEX(Objednavka!A:J,979,10)=\"\",\"\",INDEX(Objednavka!A:J,979,10))","v":""}]
[null,{"$f":"IF(INDEX(Objednavka!A:I,980,3)=\"\",INDEX(Objednavka!A:I,980,1),INDEX(Objednavka!A:I,980,3))","v":0},null,null,null,null,null,{"$f":"INDEX(Objednavka!A:I,980,4)","v":0},null,{"$f":"INDEX(Objednavka!A:I,980,5)","v":0},{"$f":"INDEX(Objednavka!A:I,980,7)","v":0},{"$f":"INDEX(Objednavka!A:I,980,8)","v":0},null,{"$f":"IF(INDEX(Objednavka!A:J,980,10)=\"\",\"\",INDEX(Objednavka!A:J,980,10))","v":""}]
[null,{"$f":"IF(INDEX(Objednavka!A:I,981,3)=\"\",INDEX(Objednavka!A:I,981,1),INDEX(Objednavka!A:I,981,3))","v":0},null,null,null,null,null,{"$f":"INDEX(Objednavka!A:I,981,4)","v":0},null,{"$f":"INDEX(Objednavka!A:I,981,5)","v":0},{"$f":"INDEX(Objednavka!A:I,981,7)","v":0},{"$f":"INDEX(Objednavka!A:I,981,8)","v":0},null,{"$f":"IF(INDEX(Objednavka!A:J,981,10)=\"\",\"\",INDEX(Objednavka!A:J,981,10))","v":""}]
[null,{"$f":"IF(INDEX(Objednavka!A:I,982,3)=\"\",INDEX(Objednavka!A:I,982,1),INDEX(Objednavka!A:I,982,3))","v":0},null,null,null,null,null,{"$f":"INDEX(Objednavka!A:I,982,4)","v":0},null,{"$f":"INDEX(Objednavka!A:I,982,5)","v":0},{"$f":"INDEX(Objednavka!A:I,982,7)","v":0},{"$f":"INDEX(Objednavka!A:I,982,8)","v":0},null,{"$f":"IF(INDEX(Objednavka!A:J,982,10)=\"\",\"\",INDEX(Objednavka!A:J,982,10))","v":""}]
[null,{"$f":"IF(INDEX(Objednavka!A:I,983,3)=\"\",INDEX(Objednavka!A:I,983,1),INDEX(Objednavka!A:I,983,3))","v":0},null,null,null,null,null,{"$f":"INDEX(Objednavka!A:I,983,4)","v":0},null,{"$f":"INDEX(Objednavka!A:I,983,5)","v":0},{"$f":"INDEX(Objednavka!A:I,983,7)","v":0},{"$f":"INDEX(Objednavka!A:I,983,8)","v":0},null,{"$f":"IF(INDEX(Objednavka!A:J,983,10)=\"\",\"\",INDEX(Objednavka!A:J,983,10))","v":""}]
[null,{"$f":"IF(INDEX(Objednavka!A:I,984,3)=\"\",INDEX(Objednavka!A:I,984,1),INDEX(Objednavka!A:I,984,3))","v":0},null,null,null,null,null,{"$f":"INDEX(Objednavka!A:I,984,4)","v":0},null,{"$f":"INDEX(Objednavka!A:I,984,5)","v":0},{"$f":"INDEX(Objednavka!A:I,984,7)","v":0},{"$f":"INDEX(Objednavka!A:I,984,8)","v":0},null,{"$f":"IF(INDEX(Objednavka!A:J,984,10)=\"\",\"\",INDEX(Objednavka!A:J,984,10))","v":""}]
[null,"Doprava",null,null,null,null,null,{"$f":"J1000*0.79","v":0},null,{"$f":"IF(Objednavka!I9=\"\",0,Objednavka!I9)","v":0},{"$f":"IF(J16=\"Hotově - osobní odběr\",0,1)","v":1},{"$f":"K1000*J1000","v":0}]
[]
[null,null,null,null,null,null,null,null,null,"Základ","Výše DPH","Celkem"]
[null,null,null,null,null,null,null,null,"Snížená DPH",{"$f":"L1003*0.85","v":0},{"$f":"L1003-J1003","v":0},{"$f":"SUM(L29:L999)","v":0}]
[null,null,null,null,null,null,null,null,"Základní DPH",{"$f":"L1004*0.79","v":0},{"$f":"L1004-J1004","v":0},{"$f":"L1000","v":0}]
[null,null,null,null,null,null,null,null,"Celkem",{"$f":"J1004+J1003","v":0},{"$f":"K1004+K1003","v":0},{"$f":"L1004+L1003","v":0}]
[null,null,null,null,null,null,null,null,null,"pozn.: Čásky jsou včetně hodnot zaokrouhlení"]
[null,null,null,null,null,null,null,null,"Celkem k úhradě: ",null,{"$f":"L1005","v":0}]